{"text_format":"1","workbook":"xlsx","n_sheets":11,"sheets":["Steuerung","Bestand","Artikel","Lieferer","Korrespondenz","A1","A2","A3","A4","A5","A6"],"not_rendered":{"charts":0,"images":21,"macros":1,"external_links":0,"defined_names":0,"comments":2,"pivot_tables":0},"unopened":[],"bounds":{"document_bytes":16777216,"sheet_cells":100000,"rows_first":2000,"rows_last":500,"rows_between":2000,"halvings":0,"cell_chars":16384,"cell_head_chars":4096},"cells_cut":0,"cells_raw":0,"read":"whole","date_system":"1900"}

{"sheet":"Steuerung","index":0,"n_rows":23,"n_cols":2,"rows_kept":23,"cut":false,"hidden":false,"merged":[[1,1,2,7],[6,1,8,4],[9,1,11,4],[6,5,8,7],[9,5,11,7],[3,1,4,4],[12,5,14,7],[15,5,17,7],[18,5,20,7],[22,1,23,7],[12,1,14,4],[15,1,17,4],[18,1,20,4]]}
[]
[null,"Lagerbestandsverwaltung"]
[]
[null,"Hilfsstoffe Jeans 002"]
[]
[]
[null,"Kontrollieren Sie die Lagerbestände und berechnen Sie Lagerkennziffern."]
[]
[]
[null,"Erfassen Sie Zu- und Abgängge und nehmen Sie neue Hilfsstoffe in das Lager auf."]
{"$rows_left_out":14}
{"sheet":"Bestand","index":1,"n_rows":31,"n_cols":11,"rows_kept":31,"cut":false,"hidden":false,"merged":[[29,8,29,9],[30,8,30,9],[19,10,20,10],[17,0,18,1],[17,8,18,9],[17,10,18,10],[17,2,18,5],[17,6,18,7],[25,8,25,9],[26,8,26,9],[27,8,27,9],[28,8,28,9],[21,8,21,9],[22,8,22,9],[23,8,23,9],[24,8,24,9],[25,6,25,7],[26,6,26,7],[27,6,27,7],[28,6,28,7],[29,6,29,7],[30,6,30,7],[27,4,27,5],[28,4,28,5],[29,4,29,5],[30,4,30,5],[19,4,20,5],[19,6,20,7],[21,6,21,7],[22,6,22,7],[23,6,23,7],[24,6,24,7],[27,2,27,3],[28,2,28,3],[29,2,29,3],[30,2,30,3],[21,4,21,5],[22,4,22,5],[23,4,23,5],[24,4,24,5],[25,4,25,5],[26,4,26,5],[21,2,21,3],[22,2,22,3],[23,2,23,3],[24,2,24,3],[25,2,25,3],[26,2,26,3],[0,0,0,10],[19,0,20,0],[19,1,20,1],[19,2,20,3],[19,8,20,9],[4,0,5,0],[4,1,5,1],[4,3,5,3],[4,4,5,4],[4,2,5,2],[4,9,5,9],[4,10,5,10],[4,5,5,5],[4,6,5,6],[4,7,5,7],[4,8,5,8]]}
["Lagerbestände Hilfsstoffe (Jeans 002)"]
[]
[]
[]
["Artikel-Nr.:","Artikel-Bezeichnung","Lieferer-Nr.:","Mengen-einheit","Höchst-bestand","Melde-bestand","Mindest-bestand","Bestand","kritische Mengen","Durch-schnittswert","Bestands-wert"]
[]
[201,{"$f":"Artikel!B7","v":"Jeansnieten"},20,{"$f":"Artikel!C7","v":"Dtzd."},{"$f":"Artikel!D7","v":1000},{"$f":"Artikel!E7","v":300},{"$f":"Artikel!F7","v":200},{"$f":"IF(Artikel!$BQ7>0,Artikel!$BQ7,IF(Artikel!$BI7>0,Artikel!$BI7,IF(Artikel!$BA7>0,Artikel!$BA7,IF(Artikel!$AS7>0,Artikel!$AS7,IF(Artikel!$AK7>0,Artikel!$AK7,IF(Artikel!$AC7>0,Artikel!$AC7,IF(Artikel!$U7>0,Artikel!$U7,IF(Artikel!$M7>0,Artikel!$M7,Artikel!$G7))))))))","v":1000},{"$f":"IF(B7=0,\"\",IF(H7>=E7,\"HöB\",IF(H7<=G7,\"MiB\",IF(H7<=F7,\"MeB\",\"\"))))","v":"HöB"},{"$f":"IF(Artikel!$BS7>0,Artikel!$BS7,IF(Artikel!$BK7>0,Artikel!$BK7,IF(Artikel!$BC7>0,Artikel!$BC7,IF(Artikel!$AU7>0,Artikel!$AU7,IF(Artikel!$AM7>0,Artikel!$AM7,IF(Artikel!$AE7>0,Artikel!$AE7,IF(Artikel!$W7>0,Artikel!$W7,IF(Artikel!$O7>0,Artikel!$O7,Artikel!$H7))))))))","v":0.23599999999999999},{"$f":"H7*J7","v":236}]
[202,{"$f":"Artikel!B8","v":"Jeansknöpfe"},20,{"$f":"Artikel!C8","v":"Dtzd."},{"$f":"Artikel!D8","v":1200},{"$f":"Artikel!E8","v":300},{"$f":"Artikel!F8","v":100},{"$f":"IF(Artikel!$BQ8>0,Artikel!$BQ8,IF(Artikel!$BI8>0,Artikel!$BI8,IF(Artikel!$BA8>0,Artikel!$BA8,IF(Artikel!$AS8>0,Artikel!$AS8,IF(Artikel!$AK8>0,Artikel!$AK8,IF(Artikel!$AC8>0,Artikel!$AC8,IF(Artikel!$U8>0,Artikel!$U8,IF(Artikel!$M8>0,Artikel!$M8,Artikel!$G8))))))))","v":350},{"$f":"IF(B8=0,\"\",IF(H8>=E8,\"HöB\",IF(H8<=G8,\"MiB\",IF(H8<=F8,\"MeB\",\"\"))))","v":""},{"$f":"IF(Artikel!$BS8>0,Artikel!$BS8,IF(Artikel!$BK8>0,Artikel!$BK8,IF(Artikel!$BC8>0,Artikel!$BC8,IF(Artikel!$AU8>0,Artikel!$AU8,IF(Artikel!$AM8>0,Artikel!$AM8,IF(Artikel!$AE8>0,Artikel!$AE8,IF(Artikel!$W8>0,Artikel!$W8,IF(Artikel!$O8>0,Artikel!$O8,Artikel!$H8))))))))","v":0.43},{"$f":"H8*J8","v":150.5}]
[203,{"$f":"Artikel!B9","v":"Gürtel Country"},22,{"$f":"Artikel!C9","v":"Stück"},{"$f":"Artikel!D9","v":500},{"$f":"Artikel!E9","v":100},{"$f":"Artikel!F9","v":50},{"$f":"IF(Artikel!$BQ9>0,Artikel!$BQ9,IF(Artikel!$BI9>0,Artikel!$BI9,IF(Artikel!$BA9>0,Artikel!$BA9,IF(Artikel!$AS9>0,Artikel!$AS9,IF(Artikel!$AK9>0,Artikel!$AK9,IF(Artikel!$AC9>0,Artikel!$AC9,IF(Artikel!$U9>0,Artikel!$U9,IF(Artikel!$M9>0,Artikel!$M9,Artikel!$G9))))))))","v":250},"",{"$f":"IF(Artikel!$BS9>0,Artikel!$BS9,IF(Artikel!$BK9>0,Artikel!$BK9,IF(Artikel!$BC9>0,Artikel!$BC9,IF(Artikel!$AU9>0,Artikel!$AU9,IF(Artikel!$AM9>0,Artikel!$AM9,IF(Artikel!$AE9>0,Artikel!$AE9,IF(Artikel!$W9>0,Artikel!$W9,IF(Artikel!$O9>0,Artikel!$O9,Artikel!$H9))))))))","v":12.75},{"$f":"H9*J9","v":3187.5}]
[204,{"$f":"Artikel!B10","v":"Gürtel City"},22,{"$f":"Artikel!C10","v":"Stück"},{"$f":"Artikel!D10","v":500},{"$f":"Artikel!E10","v":100},{"$f":"Artikel!F10","v":50},{"$f":"IF(Artikel!$BQ10>0,Artikel!$BQ10,IF(Artikel!$BI10>0,Artikel!$BI10,IF(Artikel!$BA10>0,Artikel!$BA10,IF(Artikel!$AS10>0,Artikel!$AS10,IF(Artikel!$AK10>0,Artikel!$AK10,IF(Artikel!$AC10>0,Artikel!$AC10,IF(Artikel!$U10>0,Artikel!$U10,IF(Artikel!$M10>0,Artikel!$M10,Artikel!$G10))))))))","v":350},"",{"$f":"IF(Artikel!$BS10>0,Artikel!$BS10,IF(Artikel!$BK10>0,Artikel!$BK10,IF(Artikel!$BC10>0,Artikel!$BC10,IF(Artikel!$AU10>0,Artikel!$AU10,IF(Artikel!$AM10>0,Artikel!$AM10,IF(Artikel!$AE10>0,Artikel!$AE10,IF(Artikel!$W10>0,Artikel!$W10,IF(Artikel!$O10>0,Artikel!$O10,Artikel!$H10))))))))","v":19.105555555555554},6686.9444444444443]
{"$rows_left_out":22}
{"sheet":"Artikel","index":2,"n_rows":16,"n_cols":72,"rows_kept":16,"cut":false,"hidden":false,"merged":[[4,4,5,4],[4,5,5,5],[4,6,5,6],[4,7,5,7],[4,0,5,0],[4,1,5,1],[4,2,5,2],[4,3,5,3],[4,12,5,12],[4,13,5,13],[4,14,5,14],[4,15,5,15],[4,8,5,8],[4,9,5,9],[4,10,5,10],[4,11,5,11],[4,20,5,20],[4,21,5,21],[4,22,5,22],[4,23,5,23],[4,16,5,16],[4,17,5,17],[4,18,5,18],[4,19,5,19],[4,28,5,28],[4,29,5,29],[4,30,5,30],[4,31,5,31],[4,24,5,24],[4,25,5,25],[4,26,5,26],[4,27,5,27],[4,36,5,36],[4,37,5,37],[4,38,5,38],[4,39,5,39],[4,32,5,32],[4,33,5,33],[4,34,5,34],[4,35,5,35],[4,44,5,44],[4,45,5,45],[4,46,5,46],[4,47,5,47],[4,40,5,40],[4,41,5,41],[4,42,5,42],[4,43,5,43],[4,52,5,52],[4,53,5,53],[4,54,5,54],[4,55,5,55],[4,48,5,48],[4,49,5,49],[4,50,5,50],[4,51,5,51],[4,71,5,71],[4,64,5,64],[4,65,5,65],[4,66,5,66],[4,67,5,67],[4,58,5,58],[4,59,5,59],[0,0,1,2],[4,68,5,68],[4,69,5,69],[4,70,5,70],[4,60,5,60],[4,61,5,61],[4,62,5,62],[4,63,5,63],[4,56,5,56],[4,57,5,57]]}
["Lagerbewegung Hilfsstoffe Jeans 002"]
[]
[]
[]
["Artikel-Nr.:","Artikel-Bezeichnung","Mengen-einheit","Höchst-bestand","Melde-bestand","Mindest-bestand","Anfangs-bestand","Stückpreis","Datum       1","Zugang/ Abgang","Stück-preis","Menge","Bestand","kritische Mengen","Durch-schnittswert","Bestands-wert","Datum        2","Zugang/ Abgang","Stück-preis","Menge","Bestand","kritische Mengen","Durch-schnittswert","Bestands-wert","Datum       3","Zugang/ Abgang","Stück-preis","Menge","Bestand","kritische Mengen","Durch-schnittswert","Bestands-wert","Datum        4","Zugang/ Abgang","Stück-preis","Menge","Bestand","kritische Mengen","Durch-schnittswert","Bestands-wert","Datum       5","Zugang/ Abgang","Stück-preis","Menge","Bestand","kritische Mengen","Durch-schnittswert","Bestands-wert","Datum        6","Zugang/ Abgang","Stück-preis","Menge","Bestand","kritische Mengen","Durch-schnittswert","Bestands-wert","Datum       7","Zugang/ Abgang","Stück-preis","Menge","Bestand","kritische Mengen","Durch-schnittswert","Bestands-wert","Datum        8","Zugang/ Abgang","Stück-preis","Menge","Bestand","kritische Mengen","Durch-schnittswert","Bestands-wert"]
[]
[201,"Jeansnieten","Dtzd.",1000,300,200,500,0.24,"2006-01-12","Zugang",0.22,500,{"$f":"IF(J7=\"\",0,IF(J7=\"Zugang\",G7+L7,G7-L7))","v":1000},{"$f":"IF(J7=\"\",\"\",IF(M7>=$D7,\"HöB\",IF(M7<=$F7,\"MiB\",IF(M7<=$E7,\"MeB\",\"\"))))","v":"HöB"},{"$f":"IF(J7=\"\",0,IF(J7=\"Zugang\",((H7*G7)+(K7*L7))/(G7+L7),G7))","v":0.23},{"$f":"IF(J7=\"\",\"\",M7*O7)","v":230},"2006-02-23","Abgang",null,600,{"$f":"IF(R7=\"\",0,IF(R7=\"Zugang\",M7+T7,M7-T7))","v":400},{"$f":"IF(R7=\"\",\"\",IF(U7>=$D7,\"HöB\",IF(U7<=$F7,\"MiB\",IF(U7<=$E7,\"MeB\",\"\"))))","v":""},{"$f":"IF(R7=\"\",0,IF(R7=\"Zugang\",((M7*O7)+(S7*T7))/(M7+T7),O7))","v":0.23},{"$f":"IF(R7=\"\",\"\",U7*W7)","v":92},"2006-04-16","Zugang",0.24,600,{"$f":"IF(Z7=\"\",0,IF(Z7=\"Zugang\",U7+AB7,U7-AB7))","v":1000},{"$f":"IF(Z7=\"\",\"\",IF(AC7>=$D7,\"HöB\",IF(AC7<=$F7,\"MiB\",IF(AC7<=$E7,\"MeB\",\"\"))))","v":"HöB"},{"$f":"IF(Z7=\"\",0,IF(Z7=\"Zugang\",((U7*W7)+(AA7*AB7))/(U7+AB7),W7))","v":0.23599999999999999},{"$f":"IF(Z7=\"\",\"\",AC7*AE7)","v":236},null,null,null,null,{"$f":"IF(AH7=\"\",0,IF(AH7=\"Zugang\",AC7+AJ7,AC7-AJ7))","v":0},{"$f":"IF(AH7=\"\",\"\",IF(AK7>=$D7,\"HöB\",IF(AK7<=$F7,\"MiB\",IF(AK7<=$E7,\"MeB\",\"\"))))","v":""},{"$f":"IF(AH7=\"\",0,IF(AH7=\"Zugang\",((AC7*AE7)+(AI7*AJ7))/(AC7+AJ7),AE7))","v":0},{"$f":"IF(AH7=\"\",\"\",AK7*AM7)","v":""},null,null,null,null,{"$f":"IF(AP7=\"\",0,IF(AP7=\"Zugang\",AK7+AR7,AK7-AR7))","v":0},{"$f":"IF(AP7=\"\",\"\",IF(AS7>=$D7,\"HöB\",IF(AS7<=$F7,\"MiB\",IF(AS7<=$E7,\"MeB\",\"\"))))","v":""},{"$f":"IF(AP7=\"\",0,IF(AP7=\"Zugang\",((AK7*AM7)+(AQ7*AR7))/(AK7+AR7),AM7))","v":0},{"$f":"IF(AP7=\"\",\"\",AS7*AU7)","v":""},null,null,null,null,{"$f":"IF(AX7=\"\",0,IF(AX7=\"Zugang\",AS7+AZ7,AS7-AZ7))","v":0},{"$f":"IF(AX7=\"\",\"\",IF(BA7>=$D7,\"HöB\",IF(BA7<=$F7,\"MiB\",IF(BA7<=$E7,\"MeB\",\"\"))))","v":""},{"$f":"IF(AX7=\"\",0,IF(AX7=\"Zugang\",((AS7*AU7)+(AY7*AZ7))/(AS7+AZ7),AU7))","v":0},{"$f":"IF(AX7=\"\",\"\",BA7*BC7)","v":""},null,null,null,null,{"$f":"IF(BF7=\"\",0,IF(BF7=\"Zugang\",BA7+BH7,BA7-BH7))","v":0},{"$f":"IF(BF7=\"\",\"\",IF(BI7>=$D7,\"HöB\",IF(BI7<=$F7,\"MiB\",IF(BI7<=$E7,\"MeB\",\"\"))))","v":""},{"$f":"IF(BF7=\"\",0,IF(BF7=\"Zugang\",((BA7*BC7)+(BG7*BH7))/(BA7+BH7),BC7))","v":0},{"$f":"IF(BF7=\"\",\"\",BI7*BK7)","v":""},null,null,null,null,{"$f":"IF(BN7=\"\",0,IF(BN7=\"Zugang\",BI7+BP7,BI7-BP7))","v":0},{"$f":"IF(BN7=\"\",\"\",IF(BQ7>=$D7,\"HöB\",IF(BQ7<=$F7,\"MiB\",IF(BQ7<=$E7,\"MeB\",\"\"))))","v":""},{"$f":"IF(BN7=\"\",0,IF(BN7=\"Zugang\",((BI7*BK7)+(BO7*BP7))/(BI7+BP7),BK7))","v":0},{"$f":"IF(BN7=\"\",\"\",BQ7*BS7)","v":""}]
[202,"Jeansknöpfe","Dtzd.",1200,300,100,600,0.43,"2006-01-13","Abgang",null,250,{"$f":"IF(J8=\"\",0,IF(J8=\"Zugang\",G8+L8,G8-L8))","v":350},{"$f":"IF(J8=\"\",\"\",IF(M8>=$D8,\"HöB\",IF(M8<=$F8,\"MiB\",IF(M8<=$E8,\"MeB\",\"\"))))","v":""},{"$f":"IF(J8=\"\",0,IF(J8=\"Zugang\",((H8*G8)+(K8*L8))/(G8+L8),H8))","v":0.43},{"$f":"IF(J8=\"\",\"\",M8*O8)","v":150.5},null,null,null,null,{"$f":"IF(R8=\"\",0,IF(R8=\"Zugang\",M8+T8,M8-T8))","v":0},{"$f":"IF(R8=\"\",\"\",IF(U8>=$D8,\"HöB\",IF(U8<=$F8,\"MiB\",IF(U8<=$E8,\"MeB\",\"\"))))","v":""},{"$f":"IF(R8=\"\",0,IF(R8=\"Zugang\",((M8*O8)+(S8*T8))/(M8+T8),O8))","v":0},{"$f":"IF(R8=\"\",\"\",U8*W8)","v":""},null,null,null,null,{"$f":"IF(Z8=\"\",0,IF(Z8=\"Zugang\",U8+AB8,U8-AB8))","v":0},{"$f":"IF(Z8=\"\",\"\",IF(AC8>=$D8,\"HöB\",IF(AC8<=$F8,\"MiB\",IF(AC8<=$E8,\"MeB\",\"\"))))","v":""},{"$f":"IF(Z8=\"\",0,IF(Z8=\"Zugang\",((U8*W8)+(AA8*AB8))/(U8+AB8),W8))","v":0},{"$f":"IF(Z8=\"\",\"\",AC8*AE8)","v":""},null,null,null,null,{"$f":"IF(AH8=\"\",0,IF(AH8=\"Zugang\",AC8+AJ8,AC8-AJ8))","v":0},{"$f":"IF(AH8=\"\",\"\",IF(AK8>=$D8,\"HöB\",IF(AK8<=$F8,\"MiB\",IF(AK8<=$E8,\"MeB\",\"\"))))","v":""},{"$f":"IF(AH8=\"\",0,IF(AH8=\"Zugang\",((AC8*AE8)+(AI8*AJ8))/(AC8+AJ8),AE8))","v":0},{"$f":"IF(AH8=\"\",\"\",AK8*AM8)","v":""},null,null,null,null,{"$f":"IF(AP8=\"\",0,IF(AP8=\"Zugang\",AK8+AR8,AK8-AR8))","v":0},{"$f":"IF(AP8=\"\",\"\",IF(AS8>=$D8,\"HöB\",IF(AS8<=$F8,\"MiB\",IF(AS8<=$E8,\"MeB\",\"\"))))","v":""},{"$f":"IF(AP8=\"\",0,IF(AP8=\"Zugang\",((AK8*AM8)+(AQ8*AR8))/(AK8+AR8),AM8))","v":0},{"$f":"IF(AP8=\"\",\"\",AS8*AU8)","v":""},null,null,null,null,{"$f":"IF(AX8=\"\",0,IF(AX8=\"Zugang\",AS8+AZ8,AS8-AZ8))","v":0},{"$f":"IF(AX8=\"\",\"\",IF(BA8>=$D8,\"HöB\",IF(BA8<=$F8,\"MiB\",IF(BA8<=$E8,\"MeB\",\"\"))))","v":""},{"$f":"IF(AX8=\"\",0,IF(AX8=\"Zugang\",((AS8*AU8)+(AY8*AZ8))/(AS8+AZ8),AU8))","v":0},{"$f":"IF(AX8=\"\",\"\",BA8*BC8)","v":""},null,null,null,null,{"$f":"IF(BF8=\"\",0,IF(BF8=\"Zugang\",BA8+BH8,BA8-BH8))","v":0},{"$f":"IF(BF8=\"\",\"\",IF(BI8>=$D8,\"HöB\",IF(BI8<=$F8,\"MiB\",IF(BI8<=$E8,\"MeB\",\"\"))))","v":""},{"$f":"IF(BF8=\"\",0,IF(BF8=\"Zugang\",((BA8*BC8)+(BG8*BH8))/(BA8+BH8),BC8))","v":0},{"$f":"IF(BF8=\"\",\"\",BI8*BK8)","v":""},null,null,null,null,{"$f":"IF(BN8=\"\",0,IF(BN8=\"Zugang\",BI8+BP8,BI8-BP8))","v":0},{"$f":"IF(BN8=\"\",\"\",IF(BQ8>=$D8,\"HöB\",IF(BQ8<=$F8,\"MiB\",IF(BQ8<=$E8,\"MeB\",\"\"))))","v":""},{"$f":"IF(BN8=\"\",0,IF(BN8=\"Zugang\",((BI8*BK8)+(BO8*BP8))/(BI8+BP8),BK8))","v":0},{"$f":"IF(BN8=\"\",\"\",BQ8*BS8)","v":""}]
[203,"Gürtel Country","Stück",500,100,50,200,12.75,"2006-01-02","Zugang",12.75,200,{"$f":"IF(J9=\"\",0,IF(J9=\"Zugang\",G9+L9,G9-L9))","v":400},{"$f":"IF(J9=\"\",\"\",IF(M9>=$D9,\"HöB\",IF(M9<=$F9,\"MiB\",IF(M9<=$E9,\"MeB\",\"\"))))","v":""},{"$f":"IF(J9=\"\",0,IF(J9=\"Zugang\",((H9*G9)+(K9*L9))/(G9+L9),H9))","v":12.75},{"$f":"IF(J9=\"\",\"\",M9*O9)","v":5100},"2006-03-13","Abgang",null,150,250,{"$f":"IF(R9=\"\",\"\",IF(U9>=$D9,\"HöB\",IF(U9<=$F9,\"MiB\",IF(U9<=$E9,\"MeB\",\"\"))))","v":""},{"$f":"IF(R9=\"\",0,IF(R9=\"Zugang\",((M9*O9)+(S9*T9))/(M9+T9),O9))","v":12.75},{"$f":"IF(R9=\"\",\"\",U9*W9)","v":3187.5},null,null,null,null,0,{"$f":"IF(Z9=\"\",\"\",IF(AC9>=$D9,\"HöB\",IF(AC9<=$F9,\"MiB\",IF(AC9<=$E9,\"MeB\",\"\"))))","v":""},{"$f":"IF(Z9=\"\",0,IF(Z9=\"Zugang\",((U9*W9)+(AA9*AB9))/(U9+AB9),W9))","v":0},{"$f":"IF(Z9=\"\",\"\",AC9*AE9)","v":""},null,null,null,null,{"$f":"IF(AH9=\"\",0,IF(AH9=\"Zugang\",AC9+AJ9,AC9-AJ9))","v":0},{"$f":"IF(AH9=\"\",\"\",IF(AK9>=$D9,\"HöB\",IF(AK9<=$F9,\"MiB\",IF(AK9<=$E9,\"MeB\",\"\"))))","v":""},{"$f":"IF(AH9=\"\",0,IF(AH9=\"Zugang\",((AC9*AE9)+(AI9*AJ9))/(AC9+AJ9),AE9))","v":0},{"$f":"IF(AH9=\"\",\"\",AK9*AM9)","v":""},null,null,null,null,{"$f":"IF(AP9=\"\",0,IF(AP9=\"Zugang\",AK9+AR9,AK9-AR9))","v":0},{"$f":"IF(AP9=\"\",\"\",IF(AS9>=$D9,\"HöB\",IF(AS9<=$F9,\"MiB\",IF(AS9<=$E9,\"MeB\",\"\"))))","v":""},{"$f":"IF(AP9=\"\",0,IF(AP9=\"Zugang\",((AK9*AM9)+(AQ9*AR9))/(AK9+AR9),AM9))","v":0},{"$f":"IF(AP9=\"\",\"\",AS9*AU9)","v":""},null,null,null,null,{"$f":"IF(AX9=\"\",0,IF(AX9=\"Zugang\",AS9+AZ9,AS9-AZ9))","v":0},{"$f":"IF(AX9=\"\",\"\",IF(BA9>=$D9,\"HöB\",IF(BA9<=$F9,\"MiB\",IF(BA9<=$E9,\"MeB\",\"\"))))","v":""},{"$f":"IF(AX9=\"\",0,IF(AX9=\"Zugang\",((AS9*AU9)+(AY9*AZ9))/(AS9+AZ9),AU9))","v":0},{"$f":"IF(AX9=\"\",\"\",BA9*BC9)","v":""},null,null,null,null,{"$f":"IF(BF9=\"\",0,IF(BF9=\"Zugang\",BA9+BH9,BA9-BH9))","v":0},{"$f":"IF(BF9=\"\",\"\",IF(BI9>=$D9,\"HöB\",IF(BI9<=$F9,\"MiB\",IF(BI9<=$E9,\"MeB\",\"\"))))","v":""},{"$f":"IF(BF9=\"\",0,IF(BF9=\"Zugang\",((BA9*BC9)+(BG9*BH9))/(BA9+BH9),BC9))","v":0},{"$f":"IF(BF9=\"\",\"\",BI9*BK9)","v":""},null,null,null,null,{"$f":"IF(BN9=\"\",0,IF(BN9=\"Zugang\",BI9+BP9,BI9-BP9))","v":0},{"$f":"IF(BN9=\"\",\"\",IF(BQ9>=$D9,\"HöB\",IF(BQ9<=$F9,\"MiB\",IF(BQ9<=$E9,\"MeB\",\"\"))))","v":""},{"$f":"IF(BN9=\"\",0,IF(BN9=\"Zugang\",((BI9*BK9)+(BO9*BP9))/(BI9+BP9),BK9))","v":0},{"$f":"IF(BN9=\"\",\"\",BQ9*BS9)","v":""}]
[204,"Gürtel City","Stück",500,100,50,100,18.95,"2006-02-02","Zugang",19.149999999999999,350,450,"",19.105555555555554,8597.5,"2006-02-14","Abgang",null,100,350,"",19.105555555555554,6686.9444444444443,null,null,null,null,0,"",0,"",null,null,null,null,0,"",0,"",null,null,null,null,0,"",0,"",null,null,null,null,0,"",0,"",null,null,null,null,0,"",0,"",null,null,null,null,0,"",0,""]
{"$rows_left_out":7}
{"sheet":"Lieferer","index":3,"n_rows":11,"n_cols":7,"rows_kept":11,"cut":false,"hidden":false,"merged":[[0,0,2,1]]}
["Lieferantenverzeichnis Hilfsstoffe Jeans 002"]
[]
[]
[]
["Lieferer-Nr.:","Firma","Straße/Postfach","PLZ Ort","Telefon","Fax","Email"]
[20,"ZIP GmbH Kurzwarengroßhandel","Rheinstr. 1","68294 Mannheim","0621/5544","0621/5545","info@zip.de"]
[21,"Reinhard Müller OHG","Nahestr. 25","55743 Idar-Oberstein","06781/40400","6781/404020","rm@tonline.de"]
[22,"Kirner Lederwaren GmbH","Hellbergblick 1","55666 Kirn","06752/3434","06752/3435","info@kile.de"]
[23]
[24]
{"$rows_left_out":2}
{"sheet":"Korrespondenz","index":4,"n_rows":50,"n_cols":11,"rows_kept":50,"cut":false,"hidden":false,"merged":[[8,4,8,6],[9,4,9,6],[17,0,17,1],[17,2,17,3],[17,4,17,5],[18,0,18,1],[18,2,18,3],[18,4,18,5],[15,8,24,9],[1,8,2,9],[12,0,12,1],[5,4,5,6],[6,4,6,6],[7,4,7,6],[49,0,49,6],[48,0,48,6],[20,0,20,3],[22,0,24,6],[25,4,26,4],[25,5,26,5],[25,6,26,6],[25,0,26,0],[25,1,26,2],[25,3,26,3],[27,1,27,2],[31,1,31,2],[32,1,32,2],[47,0,47,6],[35,0,39,6],[41,0,41,3],[45,1,45,2],[28,1,28,2],[29,1,29,2],[30,1,30,2]]}
[]
[null,null,null,null,null,null,null,null," Legen Sie die Art des Beleges fest"]
["Tropic GmbH, Rheingrafenstr. 20 55543 Bad Kreuznach",null,null,null,null,null,null,null,null,null,1]
[]
[]
[{"$f":"IF(C15=\"\",\"\",VLOOKUP($C$15,Lieferer!$A$6:$G$11,2))","v":""},null,null,null,"Rheingrafenstr. 20",null,null,null," Anfrage/Bestellung"]
[{"$f":"IF(C15=\"\",\"\",VLOOKUP($C$15,Lieferer!$A$6:$G$11,3))","v":""},null,null,null,"55543 Bad Kreuznach",null,null,null," Neue Anfrage/Bestellung"]
[null,null,null,null,"Tel.: 0671/2004-0",null,null,null," mit neuer Nummer"]
[{"$f":"IF(C15=\"\",\"\",VLOOKUP($C$15,Lieferer!$A$6:$G$11,4))","v":""},null,null,null,"Fax: (49) 0671/2004-10",null,null,null," (Erhöhung um 1)"]
[null,null,null,null,"info@tropic.de",null,null,null,"Anfrage/Bestellung"]
{"$rows_left_out":41}
{"sheet":"A1","index":5,"n_rows":52,"n_cols":10,"rows_kept":52,"cut":false,"hidden":false,"merged":[[34,3,34,5],[2,0,2,7],[35,3,35,5],[16,9,16,10],[17,9,17,10],[0,0,0,7],[11,3,11,5],[15,9,15,10],[6,3,6,5]]}
["Lagerbestandsverwaltung"]
[]
["Arbeitsauftrag 1"]
[]
[null,"A. Erfassen Sie mit dem aktuellen Datum die folgenden Lagerbewegungen:"]
[]
["Nr.","Datum","Artikel-Nr.:","Vorgang",null,null,"Menge","Preis"]
["1.",{"$f":"TODAY()","v":"2017-10-09"},202,"Materialentnahmeschein für Jeansknöpfe",null,null,50]
["2.","2017-10-09",203,"Abgabe von Gürteln (Country) in das Verkaufslager",null,null,25]
["3.","2017-10-09",206,"Wareneingang für den Aufnäher der Jeans 002",null,null,120,1.28]
{"$rows_left_out":43}
{"sheet":"A2","index":6,"n_rows":49,"n_cols":10,"rows_kept":49,"cut":false,"hidden":false,"merged":[[15,9,15,10],[17,9,17,10],[16,9,16,10],[0,0,0,7],[2,0,2,7],[8,1,9,1],[8,2,9,3],[8,4,9,4],[8,5,9,5],[16,2,16,3],[20,2,20,3],[7,2,7,3],[10,4,10,5],[10,1,10,3],[11,2,11,3],[12,1,13,1],[12,2,13,3],[12,4,13,4],[12,5,13,5],[17,1,18,1],[17,2,18,3],[17,4,18,4],[17,5,18,5],[19,1,19,3],[19,4,19,5],[21,4,22,4],[21,5,22,5],[25,2,25,3],[26,1,27,1],[26,2,27,3],[26,4,27,4],[26,5,27,5],[21,1,22,1],[21,2,22,3],[28,1,28,3],[28,4,28,5],[29,2,29,3],[30,1,31,1],[30,2,31,3],[30,4,31,4],[30,5,31,5],[39,5,40,5],[35,5,36,5],[37,1,37,3],[37,4,37,5],[38,2,38,3],[34,2,34,3],[35,1,36,1],[35,2,36,3],[35,4,36,4],[43,2,43,3],[44,1,45,1],[44,2,45,3],[44,4,45,4],[39,1,40,1],[39,2,40,3],[39,4,40,4],[48,1,49,1],[48,2,49,3],[48,4,49,4],[48,5,49,5],[44,5,45,5],[46,1,46,3],[46,4,46,5],[47,2,47,3]]}
["Lagerbestandsverwaltung"]
[]
["Arbeitsauftrag 2"]
[]
[null,"Erfassen Sie mit dem aktuellen Datum die folgenden Materialentnahmen:"]
[]
["1.","Materialentnahmeschein",null,null,null,"Hilfsstofflager ","Nr.:",101]
[null,"Artikel-Nr.:","Bezeichnung",null,"Menge","Kostenstelle","Buchungsvermerk"]
[null,201,"Jeansnieten",null,150,"Näherei"]
[]
{"$rows_left_out":40}
{"sheet":"A3","index":7,"n_rows":52,"n_cols":10,"rows_kept":52,"cut":false,"hidden":false,"merged":[[0,0,0,7],[2,0,2,7],[7,2,7,3],[8,1,9,1],[8,2,9,3],[8,4,9,4],[8,5,9,5],[10,1,10,3],[10,4,10,5],[11,2,11,3],[12,1,13,1],[12,2,13,3],[12,4,13,4],[12,5,13,5],[15,9,15,10],[20,7,21,7],[20,9,20,10],[18,1,19,1],[17,9,17,10],[15,6,15,7],[15,1,15,5],[18,6,19,6],[18,7,19,7],[16,9,16,10],[33,4,34,4],[28,1,29,1],[26,1,27,1],[24,9,24,10],[25,9,25,10],[26,6,27,6],[26,7,27,7],[28,6,29,6],[28,7,29,7],[28,9,28,10],[45,1,46,1],[25,2,25,4],[26,2,27,4],[26,5,27,5],[37,1,38,1],[37,2,38,3],[37,4,38,4],[37,5,38,5],[33,1,34,1],[33,2,34,3],[23,1,23,5],[23,6,23,7],[23,9,23,10],[17,2,17,4],[18,2,19,4],[20,2,21,4],[20,5,21,5],[18,5,19,5],[20,1,21,1],[20,6,21,6],[40,6,40,7],[40,9,40,10],[28,2,29,4],[28,5,29,5],[33,5,34,5],[35,1,35,3],[40,1,40,5],[35,4,35,5],[36,2,36,3],[32,2,32,3],[41,9,41,10],[42,9,42,10],[43,1,44,1],[43,6,44,6],[43,7,44,7],[42,2,42,4],[51,1,52,1],[51,6,52,6],[51,7,52,7],[45,6,46,6],[45,7,46,7],[50,2,50,4],[51,2,52,4],[51,5,52,5],[48,1,48,5],[48,6,48,7],[49,9,49,10],[50,9,50,10],[43,2,44,4],[43,5,44,5],[45,2,46,4],[45,5,46,5],[45,9,45,10],[48,9,48,10]]}
["Lagerbestandsverwaltung"]
[]
["Arbeitsauftrag 3"]
[]
[null,"Erfassen Sie mit dem aktuellen Datum die folgenden Belege:"]
[]
["1.","Materialentnahmeschein",null,null,null,"Hilfsstofflager ","Nr.:",106]
[null,"Artikel-Nr.:","Bezeichnung",null,"Menge","Kostenstelle","Buchungsvermerk"]
[null,201,"Jeansnieten",null,150,"Näherei"]
[]
{"$rows_left_out":43}
{"sheet":"A4","index":8,"n_rows":56,"n_cols":10,"rows_kept":56,"cut":false,"hidden":false,"merged":[[12,5,13,5],[0,0,0,7],[2,0,2,7],[7,2,7,3],[8,1,9,1],[8,2,9,3],[8,4,9,4],[8,5,9,5],[17,9,17,10],[17,1,18,7],[15,9,15,10],[16,9,16,10],[10,1,10,3],[10,4,10,5],[11,2,11,3],[12,1,13,1],[12,2,13,3],[12,4,13,4],[30,1,31,1],[30,2,31,4],[30,5,31,5],[30,6,31,6],[24,9,24,10],[27,1,27,5],[27,6,27,7],[27,9,27,10],[32,6,33,6],[28,9,28,10],[29,2,29,4],[29,9,29,10],[30,7,31,7],[32,7,33,7],[32,9,32,10],[37,5,38,5],[32,1,33,1],[32,2,33,4],[32,5,33,5],[36,2,36,3],[37,1,38,1],[37,2,38,3],[37,4,38,4],[39,1,39,3],[39,4,39,5],[40,2,40,3],[41,1,42,1],[41,2,42,3],[41,4,42,4],[41,5,42,5],[47,6,48,6],[47,7,48,7],[44,1,44,5],[44,6,44,7],[44,9,44,10],[45,9,45,10],[49,9,49,10],[52,1,52,5],[52,6,52,7],[52,9,52,10],[49,1,50,1],[49,2,50,4],[49,5,50,5],[49,6,50,6],[55,1,56,1],[55,2,56,4],[55,5,56,5],[55,6,56,6],[55,7,56,7],[49,7,50,7],[19,1,21,7],[15,1,15,7],[53,9,53,10],[54,2,54,4],[54,9,54,10],[46,2,46,4],[46,9,46,10],[47,1,48,1],[47,2,48,4],[47,5,48,5]]}
["Lagerbestandsverwaltung"]
[]
["Arbeitsauftrag 4"]
[]
[null,"A. Erfassen Sie mit dem aktuellen Datum den folgenden Beleg:"]
[]
["1.","Materialentnahmeschein",null,null,null,"Hilfsstofflager ","Nr.:",106]
[null,"Artikel-Nr.:","Bezeichnung",null,"Menge","Kostenstelle","Buchungsvermerk"]
[null,201,"Jeansnieten",null,450,"Näherei"]
[]
{"$rows_left_out":47}
{"sheet":"A5","index":9,"n_rows":52,"n_cols":10,"rows_kept":52,"cut":false,"hidden":false,"merged":[[43,1,43,3],[43,4,43,5],[44,2,44,3],[45,1,46,1],[45,2,46,3],[45,4,46,4],[45,5,46,5],[36,1,37,1],[36,2,37,3],[36,4,37,4],[36,5,37,5],[40,2,40,3],[41,1,42,1],[41,2,42,3],[41,4,42,4],[41,5,42,5],[32,2,33,3],[32,4,33,4],[32,5,33,5],[34,1,34,3],[34,4,34,5],[35,2,35,3],[24,2,24,4],[24,9,24,10],[25,7,26,7],[31,2,31,3],[48,6,48,7],[25,1,26,1],[25,2,26,4],[25,5,26,5],[25,6,26,6],[32,1,33,1],[15,9,15,10],[16,9,16,10],[17,9,17,10],[22,9,22,10],[0,0,0,7],[2,0,2,7],[22,1,22,5],[22,6,22,7],[50,9,50,10],[48,9,48,10],[27,9,27,10],[28,9,28,10],[23,9,23,10],[49,9,49,10]]}
["Lagerbestandsverwaltung"]
[]
["Arbeitsauftrag 5"]
[]
[null,"Für den folgenden Vorgang sind alle erforderlichen Eintragungen in der "]
[null,"Lagerkartei vorzunehmen."]
[]
[null,"Die Tropic GmbH produziert für das Jubiläum der Fa. Route 66 eine Jeans auf die das Logo des Kunden."]
[null,"aufgenäht werden soll. Dazu wird eine Produktdifferenzierung der Jeans 002 vorgenommen."]
[]
{"$rows_left_out":43}
{"sheet":"A6","index":10,"n_rows":52,"n_cols":10,"rows_kept":52,"cut":false,"hidden":false,"merged":[[46,2,46,3],[47,1,48,1],[47,2,48,3],[47,4,48,4],[47,5,48,5],[42,2,42,3],[43,1,44,1],[43,2,44,3],[43,4,44,4],[43,5,44,5],[45,1,45,3],[45,4,45,5],[31,9,31,10],[32,2,32,4],[32,9,32,10],[33,1,34,1],[33,2,34,4],[33,5,34,5],[33,6,34,6],[33,7,34,7],[17,9,17,10],[0,0,0,7],[2,0,2,7],[15,9,15,10],[16,9,16,10],[30,1,30,5],[30,6,30,7],[30,9,30,10]]}
["Lagerbestandsverwaltung"]
[]
["Arbeitsauftrag 6"]
[]
[null,"Für den folgenden Vorgang sind alle erforderlichen Eintragungen in der "]
[null,"Lagerkartei vorzunehmen."]
[]
["1.","Die Tropic GmbH will für die Jeans 002 in Zukunft einen neuen Gürtel anbieten. Dazu wird"]
[null,"zunächst der Bestand des Gürtels mit der Nr. 204 (Gity) bis auf den Mindestbestand an die"]
[null,"verschiedenen Verkaufsstellen ausgeliefert."]
{"$rows_left_out":42}