{"text_format":"1","workbook":"xlsx","n_sheets":6,"sheets":["Hinweise","Grundbuch","Hauptbuch","GuV","Bilanzbuch","Kontenplan"],"not_rendered":{"charts":0,"images":17,"macros":1,"external_links":0,"defined_names":0,"comments":0,"pivot_tables":0},"unopened":[],"bounds":{"document_bytes":16777216,"sheet_cells":100000,"rows_first":2000,"rows_last":500,"rows_between":2000,"halvings":0,"cell_chars":16384,"cell_head_chars":4096},"cells_cut":0,"cells_raw":0,"read":"whole","date_system":"1900"}

{"sheet":"Hinweise","index":0,"n_rows":28,"n_cols":1,"rows_kept":28,"cut":false,"hidden":false,"merged":[[0,0,0,7],[2,0,2,1]]}
["Geschäftsgang 6"]
[]
["Voraussetzungen"]
["Um den Geschäftsgang buchen zu können müssen Sie Kenntnisse über die folgenden Lehrninhalte haben:"]
["Buchungen auf Bestandskonten"]
["Buchungen auf Erfolgskonten"]
["Bestandsveränderungen"]
["Umsatzsteuer"]
["Buchung von Bezugskosten"]
["Buchung von Nachlässen und Erlösberichtigungen"]
[]
["Vorgehensweise"]
["1. Wählen Sie die Tabelle \"Grundbuch\"."]
[]
["2. Buchen Sie die Geschäftsvorfälle"]
["    entweder durch Direkteingabe in die entsprechenden Felder des Grundbuchs (Kontennummern und Beträge)"]
["    oder durch Aufruf von Buchungsfenstern. (Klicken Sie dazu jeweils auf die Schaltfläche \"Buchung\" und beenden"]
["    Sie die Eingabe  mit \"OK\".)"]
["    Die Kontennummern sind vierstellig anzugeben. (siehe Kontenplan). Bei zusammengesetzten Buchungssätzen"]
["    sind die Buchungen nach der Höhe der Beträge geordnet vorzunehmen. "]
[]
["3. Sie können sich den Kontenplan mit Kontennummern jederzeit durch Klick auf den"]
["    entsprechenden Button anzeigen lassen."]
[]
["4. Die Richtigkeit Ihrer Buchungen wird bestätigt oder Sie werden auf"]
["    Fehler hingewiesen. (Ohne Buchung werden Fehler angezeigt.)"]
[]
["5. Hauptbuch, Gewinn und Verlust und Bilanzbuch werden automatisch erstellt. "]

{"sheet":"Grundbuch","index":1,"n_rows":102,"n_cols":7,"rows_kept":102,"cut":false,"hidden":false,"merged":[[24,0,26,0],[16,0,17,0],[19,1,22,2],[19,5,20,6],[21,5,21,6],[22,5,22,6],[9,0,10,0],[12,1,14,2],[12,5,12,6],[13,5,13,6],[14,5,14,6],[5,1,7,2],[5,5,5,6],[6,5,6,6],[7,5,7,6],[63,1,65,2],[63,5,63,6],[64,5,64,6],[65,5,65,6],[93,0,93,2],[101,0,101,6],[96,5,96,6],[98,0,99,0],[94,5,94,6],[95,5,95,6],[1,0,1,4],[2,0,2,4],[60,0,61,0],[70,1,73,2],[70,5,71,6],[72,5,72,6],[73,5,73,6],[67,0,68,0],[28,1,30,2],[28,5,28,6],[29,5,29,6],[30,5,30,6],[32,0,33,0],[35,1,37,2],[35,5,35,6],[36,5,36,6],[37,5,37,6],[39,0,40,0],[42,1,44,2],[42,5,42,6],[43,5,43,6],[44,5,44,6],[46,0,47,0],[83,0,84,0],[49,1,51,2],[49,5,49,6],[50,5,50,6],[51,5,51,6],[53,0,54,0],[56,1,58,2],[56,5,56,6],[57,5,57,6],[58,5,58,6],[86,1,88,2],[86,5,86,6],[90,0,91,0],[87,5,87,6],[88,5,88,6],[75,0,77,0],[79,1,81,2],[79,5,79,6],[80,5,80,6],[81,5,81,6]]}
[]
["Geschäftsvorfälle"]
["Grundbuch"]
[null,null,null,null,null,null,0.19]
[]
["1.","Zieleinkauf von Baumwollstoffen von der Cotton GmbH & Co KG, ",null,"netto",18500,{"$f":"IF(AND(B10=\"2000\",B11=\"2600\",E10=\"4400\"),\"Die Konten sind richtig!\",\"Mindestens ein Konto ist falsch!\")","v":"Mindestens ein Konto ist falsch!"}]
["Geschäftsvorfall",null,null,"USt.",{"$f":"E6*G4","v":3515},{"$f":"IF(AND(D10=E6,D11=E7,G10=E8),\"Die Beträge sind richtig!\",\"Mindestens ein Betrag ist falsch!\")","v":"Mindestens ein Betrag ist falsch!"}]
[null,null,null,"brutto",{"$f":"SUM(E6:E7)","v":22015},{"$f":"IF(AND(F6=\"Die Konten sind richtig!\",F7=\"Die Beträge sind richtig!\"),\"Alles richtig!\",\"Es sind noch Fehler vorhanden!\")","v":"Es sind noch Fehler vorhanden!"}]
[null,"Soll","Konto","€","Haben","Konto","€"]
["Buchungssatz","",{"$f":"IF(B10=\"\",\"\",VLOOKUP(B10,Kontenplan!$A$4:$B$31,2))","v":""},null,"",{"$f":"IF(E10=\"\",\"\",VLOOKUP(E10,Kontenplan!$A$4:$B$31,2))","v":""}]
[null,"",{"$f":"IF(B11=\"\",\"\",VLOOKUP(B11,Kontenplan!$A$4:$B$31,2))","v":""},null,null,{"$f":"IF(E11=\"\",\"\",VLOOKUP(E11,Kontenplan!$A$4:$B$31,2))","v":""}]
[]
["2.","Bezugskosten hierauf bar,",null,"netto",600,{"$f":"IF(AND(B17=\"2001\",B18=\"2600\",E17=\"2880\"),\"Die Konten sind richtig!\",\"Mindestens ein Konto ist falsch!\")","v":"Mindestens ein Konto ist falsch!"}]
["Geschäftsvorfall",null,null,"USt.",{"$f":"E13*G4","v":114},{"$f":"IF(AND(D17=E13,D18=E14,G17=E15),\"Die Beträge sind richtig!\",\"Mindestens ein Betrag ist falsch!\")","v":"Mindestens ein Betrag ist falsch!"}]
[null,null,null,"brutto",{"$f":"SUM(E13:E14)","v":714},{"$f":"IF(AND(F13=\"Die Konten sind richtig!\",F14=\"Die Beträge sind richtig!\"),\"Alles richtig!\",\"Es sind noch Fehler vorhanden!\")","v":"Es sind noch Fehler vorhanden!"}]
[null,"Soll","Konto","€","Haben","Konto","€"]
["Buchungssatz","",{"$f":"IF(B17=\"\",\"\",VLOOKUP(B17,Kontenplan!$A$4:$B$31,2))","v":""},null,"",{"$f":"IF(E17=\"\",\"\",VLOOKUP(E17,Kontenplan!$A$4:$B$31,2))","v":""}]
[null,"",{"$f":"IF(B18=\"\",\"\",VLOOKUP(B18,Kontenplan!$A$4:$B$31,2))","v":""},null,null,{"$f":"IF(E18=\"\",\"\",VLOOKUP(E18,Kontenplan!$A$4:$B$31,2))","v":""}]
[]
["3.","Die Boutique Simone Sommer begleicht eine Ausgangsrechnung abzüglich 2% Skonto durch Banküberweisung, ",null,"Gutschrift",{"$f":"E23-(E23*2%)","v":17248},{"$f":"IF(AND(B25=\"2800\",B26=\"5001\",B27=\"4800\",E25=\"2400\"),\"Die Konten sind richtig!\",\"Mindestens ein Konto ist falsch!\")","v":"Mindestens ein Konto ist falsch!"}]
[null,null,null,"Skonto",{"$f":"ROUND(((E23*2%)*100)/(100+(100*G4)),2)","v":295.8}]
["Geschäftsvorfall",null,null,"USt.",{"$f":"ROUND(E21*G4,2)","v":56.2},{"$f":"IF(AND(D25=E20,D26=E21,D27=E22,G25=E23),\"Die Beträge sind richtig!\",\"Mindestens ein Betrag ist falsch!\")","v":"Mindestens ein Betrag ist falsch!"}]
[null,null,null,"Bruttobetrag",17600,{"$f":"IF(AND(F20=\"Die Konten sind richtig!\",F22=\"Die Beträge sind richtig!\"),\"Alles richtig!\",\"Es sind noch Fehler vorhanden!\")","v":"Es sind noch Fehler vorhanden!"}]
[null,"Soll","Konto","€","Haben","Konto","€"]
["Buchungssatz","",{"$f":"IF(B25=\"\",\"\",VLOOKUP(B25,Kontenplan!$A$4:$B$31,2))","v":""},null,"",{"$f":"IF(E25=\"\",\"\",VLOOKUP(E25,Kontenplan!$A$4:$B$31,2))","v":""}]
[null,"",{"$f":"IF(B26=\"\",\"\",VLOOKUP(B26,Kontenplan!$A$4:$B$31,2))","v":""},null,null,{"$f":"IF(E26=\"\",\"\",VLOOKUP(E26,Kontenplan!$A$4:$B$31,2))","v":""}]
[null,"",{"$f":"IF(B27=\"\",\"\",VLOOKUP(B27,Kontenplan!$A$4:$B$31,2))","v":""},null,null,{"$f":"IF(E27=\"\",\"\",VLOOKUP(E27,Kontenplan!$A$4:$B$31,2))","v":""}]
[]
["4.","Barzahlung für eine Kfz-Reparatur,",null,"netto",1100,{"$f":"IF(AND(B33=\"6160\",B34=\"2600\",E33=\"2880\"),\"Die Konten sind richtig!\",\"Mindestens ein Konto ist falsch!\")","v":"Mindestens ein Konto ist falsch!"}]
["Geschäftsvorfall",null,null,"USt.",{"$f":"E29*G4","v":209},{"$f":"IF(AND(D33=E29,D34=E30,G33=E31),\"Die Beträge sind richtig!\",\"Mindestens ein Betrag ist falsch!\")","v":"Mindestens ein Betrag ist falsch!"}]
[null,null,null,"brutto",{"$f":"SUM(E29:E30)","v":1309},{"$f":"IF(AND(F29=\"Die Konten sind richtig!\",F30=\"Die Beträge sind richtig!\"),\"Alles richtig!\",\"Es sind noch Fehler vorhanden!\")","v":"Es sind noch Fehler vorhanden!"}]
[null,"Soll","Konto","€","Haben","Konto","€"]
["Buchungssatz","",{"$f":"IF(B33=\"\",\"\",VLOOKUP(B33,Kontenplan!$A$4:$B$31,2))","v":""},null,"",{"$f":"IF(E33=\"\",\"\",VLOOKUP(E33,Kontenplan!$A$4:$B$31,2))","v":""}]
[null,"",{"$f":"IF(B34=\"\",\"\",VLOOKUP(B34,Kontenplan!$A$4:$B$31,2))","v":""},null,null,{"$f":"IF(E34=\"\",\"\",VLOOKUP(E34,Kontenplan!$A$4:$B$31,2))","v":""}]
[]
["5.","Rücksendung beschädigter Rohstoffe aus Geschäftsvorfall 1. an die Cotton GmbH & Co KG,",null,"netto",500,{"$f":"IF(AND(B40=\"4400\",E40=\"2000\",E41=\"2600\"),\"Die Konten sind richtig!\",\"Mindestens ein Konto ist falsch!\")","v":"Mindestens ein Konto ist falsch!"}]
["Geschäftsvorfall",null,null,"USt.",{"$f":"E36*G4","v":95},{"$f":"IF(AND(D40=E38,G40=E36,G41=E37),\"Die Beträge sind richtig!\",\"Mindestens ein Betrag ist falsch!\")","v":"Mindestens ein Betrag ist falsch!"}]
[null,null,null,"brutto",{"$f":"SUM(E36:E37)","v":595},{"$f":"IF(AND(F36=\"Die Konten sind richtig!\",F37=\"Die Beträge sind richtig!\"),\"Alles richtig!\",\"Es sind noch Fehler vorhanden!\")","v":"Es sind noch Fehler vorhanden!"}]
[null,"Soll","Konto","€","Haben","Konto","€"]
["Buchungssatz","",{"$f":"IF(B40=\"\",\"\",VLOOKUP(B40,Kontenplan!$A$4:$B$31,2))","v":""},null,"",{"$f":"IF(E40=\"\",\"\",VLOOKUP(E40,Kontenplan!$A$4:$B$31,2))","v":""}]
[null,null,{"$f":"IF(B41=\"\",\"\",VLOOKUP(B41,Kontenplan!$A$4:$B$31,2))","v":""},null,"",{"$f":"IF(E41=\"\",\"\",VLOOKUP(E41,Kontenplan!$A$4:$B$31,2))","v":""}]
[]
["6.","Wir gewähren der Boutique Simone Sommer einen Bonus,",null,"netto",300,{"$f":"IF(AND(B47=\"5001\",B48=\"4800\",E47=\"2400\"),\"Die Konten sind richtig!\",\"Mindestens ein Konto ist falsch!\")","v":"Mindestens ein Konto ist falsch!"}]
["Geschäftsvorfall",null,null,"USt.",{"$f":"E43*G4","v":57},{"$f":"IF(AND(D47=E43,D48=E44,G47=E45),\"Die Beträge sind richtig!\",\"Mindestens ein Betrag ist falsch!\")","v":"Mindestens ein Betrag ist falsch!"}]
[null,null,null,"brutto",{"$f":"SUM(E43:E44)","v":357},{"$f":"IF(AND(F43=\"Die Konten sind richtig!\",F44=\"Die Beträge sind richtig!\"),\"Alles richtig!\",\"Es sind noch Fehler vorhanden!\")","v":"Es sind noch Fehler vorhanden!"}]
[null,"Soll","Konto","€","Haben","Konto","€"]
["Buchungssatz","",{"$f":"IF(B47=\"\",\"\",VLOOKUP(B47,Kontenplan!$A$4:$B$31,2))","v":""},null,"",{"$f":"IF(E47=\"\",\"\",VLOOKUP(E47,Kontenplan!$A$4:$B$31,2))","v":""}]
[null,"",{"$f":"IF(B48=\"\",\"\",VLOOKUP(B48,Kontenplan!$A$4:$B$31,2))","v":""},null,null,{"$f":"IF(E48=\"\",\"\",VLOOKUP(E48,Kontenplan!$A$4:$B$31,2))","v":""}]
[]
["7.","Kauf eines Pkw, Listenpreis 32.000,00 Euro. Wir erhalten einen Treuerabatt von 20%. Zieleinkaufspreis: 25.600,00 Euro",null,"netto",25600,{"$f":"IF(AND(B54=\"0840\",B55=\"2600\",E54=\"4400\"),\"Die Konten sind richtig!\",\"Mindestens ein Konto ist falsch!\")","v":"Mindestens ein Konto ist falsch!"}]
["Geschäftsvorfall",null,null,"USt.",{"$f":"E50*G4","v":4864},{"$f":"IF(AND(D54=E50,D55=E51,G54=E52),\"Die Beträge sind richtig!\",\"Mindestens ein Betrag ist falsch!\")","v":"Mindestens ein Betrag ist falsch!"}]
[null,null,null,"brutto",{"$f":"SUM(E50:E51)","v":30464},{"$f":"IF(AND(F50=\"Die Konten sind richtig!\",F51=\"Die Beträge sind richtig!\"),\"Alles richtig!\",\"Es sind noch Fehler vorhanden!\")","v":"Es sind noch Fehler vorhanden!"}]
[null,"Soll","Konto","€","Haben","Konto","€"]
["Buchungssatz","",{"$f":"IF(B54=\"\",\"\",VLOOKUP(B54,Kontenplan!$A$4:$B$31,2))","v":""},null,"",{"$f":"IF(E54=\"\",\"\",VLOOKUP(E54,Kontenplan!$A$4:$B$31,2))","v":""}]
[null,"",{"$f":"IF(B55=\"\",\"\",VLOOKUP(B55,Kontenplan!$A$4:$B$31,2))","v":""},null,null,{"$f":"IF(E55=\"\",\"\",VLOOKUP(E55,Kontenplan!$A$4:$B$31,2))","v":""}]
[]
["8.","Verkauf von Trainingsanzügen gegen Rechnung,",null,"netto",42600,{"$f":"IF(AND(B61=\"2400\",E61=\"5000\",E62=\"4800\"),\"Die Konten sind richtig!\",\"Mindestens ein Konto ist falsch!\")","v":"Mindestens ein Konto ist falsch!"}]
["Geschäftsvorfall",null,null,"USt.",{"$f":"E57*G4","v":8094},{"$f":"IF(AND(D61=E59,G61=E57,G62=E58),\"Die Beträge sind richtig!\",\"Mindestens ein Betrag ist falsch!\")","v":"Mindestens ein Betrag ist falsch!"}]
[null,null,null,"brutto",{"$f":"SUM(E57:E58)","v":50694},{"$f":"IF(AND(F57=\"Die Konten sind richtig!\",F58=\"Die Beträge sind richtig!\"),\"Alles richtig!\",\"Es sind noch Fehler vorhanden!\")","v":"Es sind noch Fehler vorhanden!"}]
[null,"Soll","Konto","€","Haben","Konto","€"]
{"$rows_left_out":43}
{"sheet":"Hauptbuch","index":2,"n_rows":121,"n_cols":10,"rows_kept":121,"cut":false,"hidden":false,"merged":[[42,1,42,8],[30,1,30,8],[0,0,0,9],[2,1,2,8],[5,1,5,8],[8,1,8,8],[34,1,34,8],[119,1,119,8],[90,1,90,8],[62,1,62,8],[97,1,97,8],[116,1,116,8],[102,1,102,8],[107,1,107,8],[113,1,113,8],[83,1,83,8],[47,1,47,8],[11,1,11,8],[80,1,80,8],[67,1,67,8],[75,1,75,8],[16,1,16,8],[53,1,53,8],[37,1,37,8],[22,1,22,8],[25,1,25,8]]}
["Hauptbuch"]
[]
["Soll","0500 Grundstücke und Bauten",null,null,null,null,null,null,null,"Haben"]
["AB","8000",null,null,{"$f":"Bilanzbuch!C4","v":220000},"SB",8010,null,null,{"$f":"E4","v":220000}]
[]
["Soll","0700 Technische Anlagen und Maschinen",null,null,null,null,null,null,null,"Haben"]
["AB","8000",null,null,{"$f":"Bilanzbuch!C5","v":443000},"SB",8010,null,null,{"$f":"E7","v":443000}]
[]
["Soll","0800 Betriebs- und Geschäftsausstattung",null,null,null,null,null,null,null,"Haben"]
["AB","8000",null,null,{"$f":"Bilanzbuch!C6","v":76800},"SB",8010,null,null,{"$f":"E10","v":76800}]
[]
["Soll","0840 Fuhrpark",null,null,null,null,null,null,null,"Haben"]
["AB","8000",null,null,{"$f":"Bilanzbuch!C7","v":88000},"SB",8010,null,null,{"$f":"J15","v":88000}]
["7.","4400",null,null,{"$f":"Grundbuch!D54","v":0}]
[null,null,null,null,{"$f":"E13+E14","v":88000},null,null,null,null,{"$f":"E15","v":88000}]
[]
["Soll","2000 Rohstoffe",null,null,null,null,null,null,null,"Haben"]
["AB","8000",null,null,{"$f":"Bilanzbuch!C8","v":154000},"A","2002",null,null,{"$f":"E27","v":0}]
["1.","4400",null,null,{"$f":"Grundbuch!D10","v":0},"5.",4400,null,null,{"$f":"Grundbuch!G40","v":0}]
["A","2001",null,null,{"$f":"J24","v":0},"SB",8010,null,null,{"$f":"J21-J18-J19","v":154000}]
[null,null,null,null,{"$f":"SUM(E18:E20)","v":154000},null,null,null,null,{"$f":"E21","v":154000}]
[]
["Soll","2001 Bezugskosten (Rohstoffe)",null,null,null,null,null,null,null,"Haben"]
["2.","2880",null,null,{"$f":"Grundbuch!D17","v":0},"A","2000",null,null,{"$f":"E24","v":0}]
[]
["Soll","2002 Nachlässe (Rohstoffe)",null,null,null,null,null,null,null,"Haben"]
["A","2000",null,null,{"$f":"E29","v":0},"10.","4400",null,null,{"$f":"Grundbuch!G77","v":0}]
[null,null,null,null,null,"11.","4400",null,null,{"$f":"Grundbuch!G84","v":0}]
[null,null,null,null,{"$f":"J29","v":0},null,null,null,null,{"$f":"J27+J28","v":0}]
[]
["Soll","2020 Hilfsstoffe",null,null,null,null,null,null,null,"Haben"]
["AB","8000",null,null,{"$f":"Bilanzbuch!C9","v":12800},"SB",8010,null,null,{"$f":"E32","v":12800}]
[]
[]
["Soll","2030 Betriebsstoffe",null,null,null,null,null,null,null,"Haben"]
["AB","8000",null,null,{"$f":"Bilanzbuch!C10","v":7800},"SB",8010,null,null,{"$f":"E36","v":7800}]
[]
["Soll","2100 Unfertige Erzeugnisse",null,null,null,null,null,null,null,"Haben"]
["AB","8000",null,null,{"$f":"Bilanzbuch!C11","v":17800},"A","8010",null,null,{"$f":"Grundbuch!G99","v":0}]
[{"$f":"IF(E39<J39,\"A\",\"\")","v":""},{"$f":"IF(E39<J39,5200,\"\")","v":""},null,null,{"$f":"IF(E39<J39,E41-E39,\"\")","v":""},{"$f":"IF(E39>J39,\"A\",\"\")","v":"A"},{"$f":"IF(J39<E39,5200,\"\")","v":5200},null,null,{"$f":"IF($E$39>$J$39,J41-J39,\"\")","v":17800}]
[null,null,null,null,{"$f":"IF($E$39>$J$39,$E$39,$J$39)","v":17800},null,null,null,null,{"$f":"IF($E$39>$J$39,$E$39,$J$39)","v":17800}]
[]
["Soll","2200 Fertige Erzeugnisse",null,null,null,null,null,null,null,"Haben"]
["AB","8000",null,null,{"$f":"Bilanzbuch!C12","v":32700},"A","8010",null,null,{"$f":"Grundbuch!G100","v":0}]
[{"$f":"IF(E44<J44,\"A\",\"\")","v":""},{"$f":"IF(E44<J44,5200,\"\")","v":""},null,null,{"$f":"IF(E44<E46,E46-E44,\"\")","v":""},{"$f":"IF(J44<E44,\"A\",\"\")","v":"A"},{"$f":"IF(J44<E44,5200,\"\")","v":5200},null,null,{"$f":"IF(J44<E44,J46-J44,\"\")","v":32700}]
[null,null,null,null,{"$f":"IF(E44>J44,E44,J44)","v":32700},null,null,null,null,{"$f":"IF(E44>J44,E44,J44)","v":32700}]
[]
["Soll","2400 Forderungen aus Lieferungen und Leistungen",null,null,null,null,null,null,null,"Haben"]
["AB","8000",null,null,{"$f":"Bilanzbuch!C13","v":54800},"3.","2800","5001",4800,{"$f":"Grundbuch!G25","v":0}]
["8.","5000","4800",null,{"$f":"Grundbuch!D61","v":0},"6.","5001","4800",null,{"$f":"Grundbuch!G47","v":0}]
[null,null,null,null,null,"SB",8010,null,null,{"$f":"J52-J49-J50","v":54800}]
[null,null,null,null,{"$f":"SUM(E49:E51)","v":54800},null,null,null,null,{"$f":"E52","v":54800}]
[]
["Soll","2600 Vorsteuer",null,null,null,null,null,null,null,"Haben"]
["1.","4400",null,null,{"$f":"Grundbuch!D11","v":0},"5.","4400",null,null,{"$f":"Grundbuch!G41","v":0}]
["2.","2880",null,null,{"$f":"Grundbuch!D18","v":0},"10.","4400",null,null,{"$f":"Grundbuch!G78","v":0}]
["4.","2880",null,null,{"$f":"Grundbuch!D34","v":0},"11.","4400",null,null,{"$f":"Grundbuch!G85","v":0}]
["7.","4400",null,null,{"$f":"Grundbuch!D55","v":0},"A","4800",null,null,{"$f":"J61-SUM(J55:J57)","v":0}]
["9.","2880",null,null,{"$f":"Grundbuch!D69","v":0}]
["12.","2880",null,null,{"$f":"Grundbuch!D92","v":0}]
{"$rows_left_out":62}
{"sheet":"GuV","index":3,"n_rows":9,"n_cols":6,"rows_kept":9,"cut":false,"hidden":false,"merged":[[0,0,0,5],[2,1,2,4]]}
["Gewinn- und Verlustrechnung"]
[]
["Soll","8020 Gewinn und Verlust",null,null,null,"Haben"]
["5200",{"$f":"VLOOKUP(A4,Kontenplan!$A$4:$B$31,2)","v":"Bestandsveränderungen"},{"$f":"IF(Hauptbuch!J111>0,Hauptbuch!J111,0)","v":50500},"5000",{"$f":"VLOOKUP(D4,Kontenplan!$A$4:$B$31,2)","v":"Umsatzerlöse"},{"$f":"Hauptbuch!E100","v":0}]
["6140","Frachten und Fremdlager",{"$f":"Hauptbuch!J115","v":0},"5200",{"$f":"VLOOKUP(D5,Kontenplan!$A$4:$B$31,2)","v":"Bestandsveränderungen"},{"$f":"IF(Hauptbuch!E111>0,Hauptbuch!E111,0)","v":0}]
["6160","Fremdinstandhaltung",{"$f":"Hauptbuch!J118","v":0}]
["6810","Zeitungen und Fachliteratur",{"$f":"Hauptbuch!J121","v":0}]
[{"$f":"IF(SUM($F$4:$F$7)>SUM($C$4:$C$7),\"3000\",\"\")","v":""},{"$f":"IF(SUM($F$4:$F$7)>SUM($C$4:$C$7),\"Eigenkapital\",\"\")","v":""},{"$f":"IF(SUM($F$4:$F$7)>SUM($C$4:$C$7),SUM($F$4:$F$7)-SUM($C$4:$C$7),0)","v":0},{"$f":"IF(SUM($F$4:$F$7)>SUM($C$4:$C$7),\"\",\"3000\")","v":"3000"},{"$f":"IF(SUM($F$4:$F$7)>SUM($C$4:$C$7),\"\",\"Eigenkapital\")","v":"Eigenkapital"},{"$f":"IF(SUM($C$4:$C$7)>SUM($F$4:$F$5),SUM($C$4:$C$7)-SUM($F$4:$F$5),0)","v":50500}]
[null,null,{"$f":"IF(SUM($F$4:$F$7)>SUM($C$4:$C$7),SUM($F$4:$F$7),SUM($C$4:$C$7))","v":50500},null,null,{"$f":"SUM(F4:F8)","v":50500}]

{"sheet":"Bilanzbuch","index":4,"n_rows":31,"n_cols":6,"rows_kept":31,"cut":false,"hidden":false,"merged":[[2,1,2,4],[0,0,0,5],[17,1,17,4]]}
["Bilanzbuch"]
[]
["Aktiva","8000 Eröffnungsbilanz",null,null,null,"Passiva"]
["0500",{"$f":"VLOOKUP(A4,Kontenplan!$A$4:$B$31,2)","v":"Grundstücke und Bauten"},220000,"3000",{"$f":"VLOOKUP(D4,Kontenplan!$A$4:$B$31,2)","v":"Eigenkapital"},{"$f":"F16-SUM(F5:F15)","v":714080}]
["0700",{"$f":"VLOOKUP(A5,Kontenplan!$A$4:$B$31,2)","v":"Technische Anlagen und Maschinen"},443000,"4200","Verbindlichkeiten g. Kreditinstitute",450000]
["0800",{"$f":"VLOOKUP(A6,Kontenplan!$A$4:$B$31,2)","v":"Beriebs- und Geschäftsausstattung"},76800,"4400",{"$f":"VLOOKUP(D6,Kontenplan!$A$4:$B$31,2)","v":"Verbindlichkeiten a.L.u.L."},34600]
["0840","Fuhrpark",88000,"4800",{"$f":"VLOOKUP(D7,Kontenplan!$A$4:$B$31,2)","v":"Umsatzsteuer"},8120]
["2000",{"$f":"VLOOKUP(A8,Kontenplan!$A$4:$B$31,2)","v":"Rohstoffe"},154000]
["2020",{"$f":"VLOOKUP(A9,Kontenplan!$A$4:$B$31,2)","v":"Hilfsstoffe"},12800]
["2030",{"$f":"VLOOKUP(A10,Kontenplan!$A$4:$B$31,2)","v":"Betriebsstoffe"},7800]
["2100",{"$f":"VLOOKUP(A11,Kontenplan!$A$4:$B$31,2)","v":"Unfertige Erzeugnisse"},17800]
["2200",{"$f":"VLOOKUP(A12,Kontenplan!$A$4:$B$31,2)","v":"Fertige Erzeugnisse"},32700]
["2400",{"$f":"VLOOKUP(A13,Kontenplan!$A$4:$B$31,2)","v":"Forderungen a.L.u.L."},54800]
["2800",{"$f":"VLOOKUP(A14,Kontenplan!$A$4:$B$31,2)","v":"Kreditinstitute/Bank"},87900]
["2880",{"$f":"VLOOKUP(A15,Kontenplan!$A$4:$B$31,2)","v":"Kasse"},11200]
[null,null,{"$f":"SUM(C4:C15)","v":1206800},null,null,{"$f":"C16","v":1206800}]
[]
["Aktiva","8010 Schlussbilanz",null,null,null,"Passiva"]
["0500",{"$f":"VLOOKUP(A19,Kontenplan!$A$4:$B$31,2)","v":"Grundstücke und Bauten"},{"$f":"Hauptbuch!J4","v":220000},"3000",{"$f":"VLOOKUP(D19,Kontenplan!$A$4:$B$31,2)","v":"Eigenkapital"},{"$f":"Hauptbuch!E78","v":663580}]
["0700",{"$f":"VLOOKUP(A20,Kontenplan!$A$4:$B$31,2)","v":"Technische Anlagen und Maschinen"},{"$f":"Hauptbuch!J7","v":443000},"4200","Verbindlichkeiten g. Kreditinstitute",{"$f":"Hauptbuch!E82","v":450000}]
["0800",{"$f":"VLOOKUP(A21,Kontenplan!$A$4:$B$31,2)","v":"Beriebs- und Geschäftsausstattung"},{"$f":"Hauptbuch!J10","v":76800},"4400",{"$f":"VLOOKUP(D21,Kontenplan!$A$4:$B$31,2)","v":"Verbindlichkeiten a.L.u.L."},{"$f":"Hauptbuch!E88","v":34600}]
["0840","Fuhrpark",{"$f":"Hauptbuch!J13","v":88000},"4800",{"$f":"VLOOKUP(D22,Kontenplan!$A$4:$B$31,2)","v":"Umsatzsteuer"},{"$f":"Hauptbuch!E95","v":8120}]
["2000",{"$f":"VLOOKUP(A23,Kontenplan!$A$4:$B$31,2)","v":"Rohstoffe"},{"$f":"Hauptbuch!J20","v":154000}]
["2020",{"$f":"VLOOKUP(A24,Kontenplan!$A$4:$B$31,2)","v":"Hilfsstoffe"},{"$f":"Hauptbuch!J32","v":12800}]
["2030",{"$f":"VLOOKUP(A25,Kontenplan!$A$4:$B$31,2)","v":"Betriebsstoffe"},{"$f":"Hauptbuch!J36","v":7800}]
["2100",{"$f":"VLOOKUP(A26,Kontenplan!$A$4:$B$31,2)","v":"Unfertige Erzeugnisse"},{"$f":"Grundbuch!D99","v":0}]
["2200",{"$f":"VLOOKUP(A27,Kontenplan!$A$4:$B$31,2)","v":"Fertige Erzeugnisse"},{"$f":"Grundbuch!D100","v":0}]
["2400",{"$f":"VLOOKUP(A28,Kontenplan!$A$4:$B$31,2)","v":"Forderungen a.L.u.L."},{"$f":"Hauptbuch!J51","v":54800}]
["2800",{"$f":"VLOOKUP(A29,Kontenplan!$A$4:$B$31,2)","v":"Kreditinstitute/Bank"},{"$f":"Hauptbuch!J65","v":87900}]
["2880",{"$f":"VLOOKUP(A30,Kontenplan!$A$4:$B$31,2)","v":"Kasse"},{"$f":"Hauptbuch!J73","v":11200}]
[null,null,{"$f":"SUM(C19:C30)","v":1156300},null,null,{"$f":"SUM(F19:F30)","v":1156300}]

{"sheet":"Kontenplan","index":5,"n_rows":31,"n_cols":2,"rows_kept":31,"cut":false,"hidden":false,"merged":[]}
[null,"Kontenplan"]
[]
["Nr.","Konto"]
["0500","Grundstücke und Bauten"]
["0700","Technische Anlagen und Maschinen"]
["0800","Beriebs- und Geschäftsausstattung"]
["0840","Fuhrpark"]
["2000","Rohstoffe"]
["2001","Bezugskosten (Rohstoffe)"]
["2002","Nachlässe (Rohstoffe)"]
["2020","Hilfsstoffe"]
["2030","Betriebsstoffe"]
["2100","Unfertige Erzeugnisse"]
["2200","Fertige Erzeugnisse"]
["2400","Forderungen a.L.u.L."]
["2600","Vorsteuer"]
["2800","Kreditinstitute/Bank"]
["2880","Kasse"]
["3000","Eigenkapital"]
["4200","Verbindlichkeiten g. Kreditinstitute"]
["4400","Verbindlichkeiten a.L.u.L."]
["4800","Umsatzsteuer"]
["5000","Umsatzerlöse"]
["5001","Erlösberichtigungen"]
["5200","Bestandsveränderungen"]
["6140","Frachten und Fremdlager"]
["6160","Fremdinstandhaltung"]
["6810","Zeitungen und Fachliteratur"]
["8000","Eröffnungsbilanz"]
["8010","Schlussbilanz"]
["8020","Gewinn und Verlust"]