{"text_format":"1","workbook":"xlsx","n_sheets":6,"sheets":["Hinweise","Grundbuch","Hauptbuch","GuV","Bilanzbuch","Kontenplan"],"not_rendered":{"charts":0,"images":18,"macros":1,"external_links":0,"defined_names":0,"comments":0,"pivot_tables":0},"unopened":[],"bounds":{"document_bytes":16777216,"sheet_cells":100000,"rows_first":2000,"rows_last":500,"rows_between":2000,"halvings":0,"cell_chars":16384,"cell_head_chars":4096},"cells_cut":0,"cells_raw":0,"read":"whole","date_system":"1900"}

{"sheet":"Hinweise","index":0,"n_rows":28,"n_cols":1,"rows_kept":28,"cut":false,"hidden":false,"merged":[[0,0,0,7],[2,0,2,1]]}
["Geschäftsgang 5"]
[]
["Voraussetzungen"]
["Um den Geschäftsgang buchen zu können müssen Sie Kenntnisse über die folgenden Lehrninhalte haben:"]
["Buchungen auf Bestandskonten"]
["Buchungen auf Erfolgskonten"]
["Bestandsveränderungen"]
["Umsatzsteuer"]
["Buchung von Bezugskosten"]
["Buchung von Nachlässen und Erlösberichtigungen"]
[]
["Vorgehensweise"]
["1. Wählen Sie die Tabelle \"Grundbuch\"."]
[]
["2. Buchen Sie die Geschäftsvorfälle"]
["    entweder durch Direkteingabe in die entsprechenden Felder des Grundbuchs (Kontennummern und Beträge)"]
["    oder durch Aufruf von Buchungsfenstern. (Klicken Sie dazu jeweils auf die Schaltfläche \"Buchung\" und beenden"]
["    Sie die Eingabe  mit \"OK\".)"]
["    Die Kontennummern sind vierstellig anzugeben. (siehe Kontenplan). Bei zusammengesetzten Buchungssätzen"]
["    sind die Buchungen nach der Höhe der Beträge geordnet vorzunehmen. "]
[]
["3. Sie können sich den Kontenplan mit Kontennummern jederzeit durch Klick auf den"]
["    entsprechenden Button anzeigen lassen."]
[]
["4. Die Richtigkeit Ihrer Buchungen wird bestätigt oder Sie werden auf"]
["    Fehler hingewiesen. (Ohne Buchung werden Fehler angezeigt.)"]
[]
["5. Hauptbuch, Gewinn und Verlust und Bilanzbuch werden automatisch erstellt. "]

{"sheet":"Grundbuch","index":1,"n_rows":115,"n_cols":7,"rows_kept":115,"cut":false,"hidden":false,"merged":[[111,0,112,0],[107,5,107,6],[108,5,108,6],[99,5,99,6],[100,5,100,6],[81,5,81,6],[82,5,82,6],[83,5,83,6],[109,5,109,6],[69,6,70,6],[69,0,70,0],[69,1,70,1],[69,2,70,2],[69,3,70,3],[106,0,106,2],[102,0,104,0],[97,5,98,6],[69,4,70,4],[69,5,70,5],[114,0,114,6],[1,0,1,4],[2,0,2,4],[12,1,14,2],[12,5,12,6],[13,5,13,6],[14,5,14,6],[16,0,17,0],[58,1,60,2],[58,5,58,6],[5,5,5,6],[6,5,6,6],[7,5,7,6],[9,0,10,0],[9,1,10,1],[9,2,10,2],[9,3,10,3],[9,4,10,4],[9,5,10,5],[9,6,10,6],[23,0,24,0],[26,1,28,2],[26,5,26,6],[27,5,27,6],[28,5,28,6],[19,1,21,2],[19,5,19,6],[20,5,20,6],[21,5,21,6],[46,0,47,0],[33,5,34,6],[38,0,40,0],[30,0,31,0],[33,1,36,2],[35,5,35,6],[36,5,36,6],[49,1,52,2],[51,5,51,6],[52,5,52,6],[42,1,44,2],[42,5,42,6],[43,5,43,6],[44,5,44,6],[72,1,75,2],[74,5,74,6],[75,5,75,6],[54,0,56,0],[65,5,65,6],[66,5,66,6],[67,5,67,6],[59,5,59,6],[60,5,60,6],[62,0,63,0],[93,0,95,0],[88,5,89,6],[72,5,73,6],[49,5,50,6],[85,0,86,0],[88,1,91,2],[90,5,90,6],[91,5,91,6],[77,0,79,0],[81,1,83,2]]}
[]
["Geschäftsvorfälle"]
["Grundbuch"]
[null,null,null,null,null,null,0.19]
[]
["1.","Banküberweisung der Umsatzsteuer-Zahllast",null,null,4000,{"$f":"IF(AND(B10=\"4800\",E10=\"2800\"),\"Die Konten sind richtig!\",\"Mindestens ein Konto ist falsch!\")","v":"Mindestens ein Konto ist falsch!"}]
["Geschäftsvorfall",null,null,null,null,{"$f":"IF(AND(D10=E6,G10=E6),\"Die Beträge sind richtig!\",\"Mindestens ein Betrag ist falsch!\")","v":"Mindestens ein Betrag ist falsch!"}]
[null,null,null,null,null,{"$f":"IF(AND(F6=\"Die Konten sind richtig!\",F7=\"Die Beträge sind richtig!\"),\"Alles richtig!\",\"Es sind noch Fehler vorhanden!\")","v":"Es sind noch Fehler vorhanden!"}]
[null,"Soll","Konto","€","Haben","Konto","€"]
["Buchungssatz","",{"$f":"IF(B10=\"\",\"\",VLOOKUP(B10,Kontenplan!$A$4:$B$33,2))","v":""},null,"",{"$f":"IF(E10=\"\",\"\",VLOOKUP(E10,Kontenplan!$A$4:$B$33,2))","v":""}]
[]
[]
["2.","Zieleinkauf von Rohstoffen, ",null,"netto",8000,{"$f":"IF(AND(B17=\"2000\",B18=\"2600\",E17=\"4400\"),\"Die Konten sind richtig!\",\"Mindestens ein Konto ist falsch!\")","v":"Mindestens ein Konto ist falsch!"}]
["Geschäftsvorfall",null,null,"USt.",{"$f":"E13*G4","v":1520},{"$f":"IF(AND(D17=E13,D18=E14,G17=E15),\"Die Beträge sind richtig!\",\"Mindestens ein Betrag ist falsch!\")","v":"Mindestens ein Betrag ist falsch!"}]
[null,null,null,"brutto",{"$f":"SUM(E13:E14)","v":9520},{"$f":"IF(AND(F13=\"Die Konten sind richtig!\",F14=\"Die Beträge sind richtig!\"),\"Alles richtig!\",\"Es sind noch Fehler vorhanden!\")","v":"Es sind noch Fehler vorhanden!"}]
[null,"Soll","Konto","€","Haben","Konto","€"]
["Buchungssatz","",{"$f":"IF(B17=\"\",\"\",VLOOKUP(B17,Kontenplan!$A$4:$B$33,2))","v":""},null,"",{"$f":"IF(E17=\"\",\"\",VLOOKUP(E17,Kontenplan!$A$4:$B$33,2))","v":""}]
[null,"",{"$f":"IF(B18=\"\",\"\",VLOOKUP(B18,Kontenplan!$A$4:$B$33,2))","v":""},null,null,{"$f":"IF(E18=\"\",\"\",VLOOKUP(E18,Kontenplan!$A$4:$B$33,2))","v":""}]
[]
["3.","Eingangsfracht für den Rohstoffeinkauf aus Geschäftsvorfall 2 bar,",null,"netto",100,{"$f":"IF(AND(B24=\"2001\",B25=\"2600\",E24=\"2880\"),\"Die Konten sind richtig!\",\"Mindestens ein Konto ist falsch!\")","v":"Mindestens ein Konto ist falsch!"}]
["Geschäftsvorfall",null,null,"USt.",{"$f":"E20*G4","v":19},{"$f":"IF(AND(D24=E20,D25=E21,G24=E22),\"Die Beträge sind richtig!\",\"Mindestens ein Betrag ist falsch!\")","v":"Mindestens ein Betrag ist falsch!"}]
[null,null,null,"brutto",{"$f":"SUM(E20:E21)","v":119},{"$f":"IF(AND(F20=\"Die Konten sind richtig!\",F21=\"Die Beträge sind richtig!\"),\"Alles richtig!\",\"Es sind noch Fehler vorhanden!\")","v":"Es sind noch Fehler vorhanden!"}]
[null,"Soll","Konto","€","Haben","Konto","€"]
["Buchungssatz","",{"$f":"IF(B24=\"\",\"\",VLOOKUP(B24,Kontenplan!$A$4:$B$33,2))","v":""},null,"",{"$f":"IF(E24=\"\",\"\",VLOOKUP(E24,Kontenplan!$A$4:$B$33,2))","v":""}]
[null,"",{"$f":"IF(B25=\"\",\"\",VLOOKUP(B25,Kontenplan!$A$4:$B$33,2))","v":""},null,null,{"$f":"IF(E25=\"\",\"\",VLOOKUP(E25,Kontenplan!$A$4:$B$33,2))","v":""}]
[]
["4.","Barkauf eines Computers,",null,"netto",1400,{"$f":"IF(AND(B31=\"0800\",B32=\"2600\",E31=\"2880\"),\"Die Konten sind richtig!\",\"Mindestens ein Konto ist falsch!\")","v":"Mindestens ein Konto ist falsch!"}]
["Geschäftsvorfall",null,null,"USt.",{"$f":"E27*G4","v":266},{"$f":"IF(AND(D31=E27,D32=E28,G31=E29),\"Die Beträge sind richtig!\",\"Mindestens ein Betrag ist falsch!\")","v":"Mindestens ein Betrag ist falsch!"}]
[null,null,null,"brutto",{"$f":"SUM(E27:E28)","v":1666},{"$f":"IF(AND(F27=\"Die Konten sind richtig!\",F28=\"Die Beträge sind richtig!\"),\"Alles richtig!\",\"Es sind noch Fehler vorhanden!\")","v":"Es sind noch Fehler vorhanden!"}]
[null,"Soll","Konto","€","Haben","Konto","€"]
["Buchungssatz","",{"$f":"IF(B31=\"\",\"\",VLOOKUP(B31,Kontenplan!$A$4:$B$33,2))","v":""},null,"",{"$f":"IF(E31=\"\",\"\",VLOOKUP(E31,Kontenplan!$A$4:$B$33,2))","v":""}]
[null,"",{"$f":"IF(B32=\"\",\"\",VLOOKUP(B32,Kontenplan!$A$4:$B$33,2))","v":""},null,null,{"$f":"IF(E32=\"\",\"\",VLOOKUP(E32,Kontenplan!$A$4:$B$33,2))","v":""}]
[]
["5.","Banküberweisung der Liefererrechnung aus Geschäftsvorfall 2 abzüglich 2% Skonto. (Nettobuchung)",null,"Lastschrift",{"$f":"ROUND(E15-(E15*2%),2)","v":9329.6},{"$f":"IF(AND(B39=\"4400\",E39=\"2800\",E40=\"2002\",E41=\"2600\"),\"Die Konten sind richtig!\",\"Mindestens ein Konto ist falsch!\")","v":"Mindestens ein Konto ist falsch!"}]
[null,null,null,"Skonto",{"$f":"ROUND(E13*2%,2)","v":160}]
["Geschäftsvorfall",null,null,"USt.",{"$f":"ROUND(E35*G4,2)","v":30.4},{"$f":"IF(AND(D39=E37,G39=E34,G40=E35,G41=E36),\"Die Beträge sind richtig!\",\"Mindestens ein Betrag ist falsch!\")","v":"Mindestens ein Betrag ist falsch!"}]
[null,null,null,"Bruttobetrag",{"$f":"SUM(E34:E36)","v":9520},{"$f":"IF(AND(F34=\"Die Konten sind richtig!\",F36=\"Die Beträge sind richtig!\"),\"Alles richtig!\",\"Es sind noch Fehler vorhanden!\")","v":"Es sind noch Fehler vorhanden!"}]
[null,"Soll","Konto","€","Haben","Konto","€"]
["Buchungssatz","",{"$f":"IF(B39=\"\",\"\",VLOOKUP(B39,Kontenplan!$A$4:$B$33,2))","v":""},null,"",{"$f":"IF(E39=\"\",\"\",VLOOKUP(E39,Kontenplan!$A$4:$B$33,2))","v":""}]
[null,null,{"$f":"IF(B40=\"\",\"\",VLOOKUP(B40,Kontenplan!$A$4:$B$33,2))","v":""},null,"",{"$f":"IF(E40=\"\",\"\",VLOOKUP(E40,Kontenplan!$A$4:$B$33,2))","v":""}]
[null,null,{"$f":"IF(B41=\"\",\"\",VLOOKUP(B41,Kontenplan!$A$4:$B$33,2))","v":""},null,"",{"$f":"IF(E41=\"\",\"\",VLOOKUP(E41,Kontenplan!$A$4:$B$33,2))","v":""}]
[]
["6.","Zieleinkauf von Hilfsstoffen, ",null,"netto",2000,{"$f":"IF(AND(B47=\"2020\",B48=\"2600\",E47=\"4400\"),\"Die Konten sind richtig!\",\"Mindestens ein Konto ist falsch!\")","v":"Mindestens ein Konto ist falsch!"}]
["Geschäftsvorfall",null,null,"USt.",{"$f":"E43*G4","v":380},{"$f":"IF(AND(D47=E43,D48=E44,G47=E45),\"Die Beträge sind richtig!\",\"Mindestens ein Betrag ist falsch!\")","v":"Mindestens ein Betrag ist falsch!"}]
[null,null,null,"brutto",{"$f":"SUM(E43:E44)","v":2380},{"$f":"IF(AND(F43=\"Die Konten sind richtig!\",F44=\"Die Beträge sind richtig!\"),\"Alles richtig!\",\"Es sind noch Fehler vorhanden!\")","v":"Es sind noch Fehler vorhanden!"}]
[null,"Soll","Konto","€","Haben","Konto","€"]
["Buchungssatz","",{"$f":"IF(B47=\"\",\"\",VLOOKUP(B47,Kontenplan!$A$4:$B$33,2))","v":""},null,"",{"$f":"IF(E47=\"\",\"\",VLOOKUP(E47,Kontenplan!$A$4:$B$33,2))","v":""}]
[null,"",{"$f":"IF(B48=\"\",\"\",VLOOKUP(B48,Kontenplan!$A$4:$B$33,2))","v":""},null,"",{"$f":"IF(E48=\"\",\"\",VLOOKUP(E48,Kontenplan!$A$4:$B$33,2))","v":""}]
[]
["7.","Banküberweisung der Liefererrechnung aus Geschäftsvorfall 6 abzüglich 3% Skonto. (Nettobuchung)",null,"Lastschrift",{"$f":"ROUND(E45-(E45*3%),2)","v":2308.6},{"$f":"IF(AND(B55=\"4400\",E55=\"2800\",E56=\"2022\",E57=\"2600\"),\"Die Konten sind richtig!\",\"Mindestens ein Konto ist falsch!\")","v":"Mindestens ein Konto ist falsch!"}]
[null,null,null,"Skonto",{"$f":"ROUND(E43*3%,2)","v":60}]
["Geschäftsvorfall",null,null,"USt.",{"$f":"ROUND(E51*G4,2)","v":11.4},{"$f":"IF(AND(D55=E53,G55=E50,G56=E51,G57=E52),\"Die Beträge sind richtig!\",\"Mindestens ein Betrag ist falsch!\")","v":"Mindestens ein Betrag ist falsch!"}]
[null,null,null,"Bruttobetrag",{"$f":"SUM(E50:E52)","v":2380},{"$f":"IF(AND(F50=\"Die Konten sind richtig!\",F52=\"Die Beträge sind richtig!\"),\"Alles richtig!\",\"Es sind noch Fehler vorhanden!\")","v":"Es sind noch Fehler vorhanden!"}]
[null,"Soll","Konto","€","Haben","Konto","€"]
["Buchungssatz","",{"$f":"IF(B55=\"\",\"\",VLOOKUP(B55,Kontenplan!$A$4:$B$33,2))","v":""},null,"",{"$f":"IF(E55=\"\",\"\",VLOOKUP(E55,Kontenplan!$A$4:$B$33,2))","v":""}]
[null,null,{"$f":"IF(B56=\"\",\"\",VLOOKUP(B56,Kontenplan!$A$4:$B$33,2))","v":""},null,"",{"$f":"IF(E56=\"\",\"\",VLOOKUP(E56,Kontenplan!$A$4:$B$33,2))","v":""}]
[null,null,{"$f":"IF(B57=\"\",\"\",VLOOKUP(B57,Kontenplan!$A$4:$B$33,2))","v":""},null,"",{"$f":"IF(E57=\"\",\"\",VLOOKUP(E57,Kontenplan!$A$4:$B$33,2))","v":""}]
[]
["8.","Zielverkauf von fertigen Erzeugnissen,",null,"netto",165000,{"$f":"IF(AND(B63=\"2400\",E63=\"5000\",E64=\"4800\"),\"Die Konten sind richtig!\",\"Mindestens ein Konto ist falsch!\")","v":"Mindestens ein Konto ist falsch!"}]
["Geschäftsvorfall",null,null,"USt.",{"$f":"E59*G4","v":31350},{"$f":"IF(AND(D63=E61,G63=E59,G64=E60),\"Die Beträge sind richtig!\",\"Mindestens ein Betrag ist falsch!\")","v":"Mindestens ein Betrag ist falsch!"}]
{"$rows_left_out":56}
{"sheet":"Hauptbuch","index":2,"n_rows":125,"n_cols":10,"rows_kept":125,"cut":false,"hidden":false,"merged":[[114,1,114,8],[117,1,117,8],[120,1,120,8],[105,1,105,8],[108,1,108,8],[66,1,66,8],[100,1,100,8],[75,1,75,8],[81,1,81,8],[86,1,86,8],[93,1,93,8],[22,1,22,8],[31,1,31,8],[40,1,40,8],[48,1,48,8],[53,1,53,8],[58,1,58,8],[123,1,123,8],[0,0,0,9],[2,1,2,8],[5,1,5,8],[8,1,8,8],[13,1,13,8],[25,1,25,8],[34,1,34,8],[43,1,43,8],[19,1,19,8]]}
["Hauptbuch"]
[]
["Soll","0500 Grundstücke und Bauten",null,null,null,null,null,null,null,"Haben"]
["AB","8000",null,null,{"$f":"Bilanzbuch!C4","v":100000},"SB",8010,null,null,{"$f":"E4","v":100000}]
[]
["Soll","0700 Technische Anlagen und Maschinen",null,null,null,null,null,null,null,"Haben"]
["AB","8000",null,null,{"$f":"Bilanzbuch!C5","v":80000},"SB",8010,null,null,{"$f":"E7","v":80000}]
[]
["Soll","0800 Betriebs- und Geschäftsausstattung",null,null,null,null,null,null,null,"Haben"]
["AB","8000",null,null,{"$f":"Bilanzbuch!C6","v":20000},"SB",8010,null,null,{"$f":"J12","v":20000}]
["4.","2880",null,null,{"$f":"Grundbuch!D31","v":0}]
[null,null,null,null,{"$f":"SUM(E10:E11)","v":20000},null,null,null,null,{"$f":"E12","v":20000}]
[]
["Soll","2000 Rohstoffe",null,null,null,null,null,null,null,"Haben"]
["AB","8000",null,null,{"$f":"Bilanzbuch!C7","v":40000},"13.",{"$f":"Grundbuch!B103","v":""},null,null,{"$f":"Grundbuch!G103","v":0}]
["2.","4400",null,null,{"$f":"Grundbuch!D17","v":0},"A","2002",null,null,{"$f":"E24","v":0}]
["A","2001",null,null,{"$f":"J21","v":0},"SB",8010,null,null,{"$f":"J18-SUM(J15:J16)","v":40000}]
[null,null,null,null,{"$f":"SUM(E15:E17)","v":40000},null,null,null,null,{"$f":"E18","v":40000}]
[]
["Soll","2001 Bezugskosten (Rohstoffe)",null,null,null,null,null,null,null,"Haben"]
["3.","2880",null,null,{"$f":"Grundbuch!D24","v":0},"A","2000",null,null,{"$f":"E21","v":0}]
[]
["Soll","2002 Nachlässe (Rohstoffe)",null,null,null,null,null,null,null,"Haben"]
["A","2000",null,null,{"$f":"J24","v":0},"5.","4400",null,null,{"$f":"Grundbuch!G40","v":0}]
[]
["Soll","2020 Hilfsstoffe",null,null,null,null,null,null,null,"Haben"]
["AB","8000",null,null,{"$f":"Bilanzbuch!C8","v":8000},"13.","6020",null,null,{"$f":"Grundbuch!G104","v":0}]
["6.","4400",null,null,{"$f":"Grundbuch!D47","v":0},"A","2022",null,null,{"$f":"E33","v":0}]
[null,null,null,null,null,"SB",8010,null,null,{"$f":"J30-SUM(J27:J28)","v":8000}]
[null,null,null,null,{"$f":"SUM(E27:E28)","v":8000},null,null,null,null,{"$f":"E30","v":8000}]
[]
["Soll","2022 Nachlässe (Hilfsstoffe)",null,null,null,null,null,null,null,"Haben"]
["A","2020",null,null,{"$f":"J33","v":0},"7.","4400",null,null,{"$f":"Grundbuch!G56","v":0}]
[]
["Soll","2030 Betriebsstoffe",null,null,null,null,null,null,null,"Haben"]
["AB","8000",null,null,{"$f":"Bilanzbuch!C9","v":3000},"13.","6030",null,null,{"$f":"Grundbuch!G105","v":0}]
["11.","4400",null,null,{"$f":"Grundbuch!D86","v":0},"A","2032",null,null,{"$f":"E42","v":0}]
[null,null,null,null,null,"SB",8010,null,null,{"$f":"J39-SUM(J36:J37)","v":3000}]
[null,null,null,null,{"$f":"SUM(E36:E38)","v":3000},null,null,null,null,{"$f":"E39","v":3000}]
[]
["Soll","2032 Nachlässe (Betriebsstoffe)",null,null,null,null,null,null,null,"Haben"]
["A","2030",null,null,{"$f":"J42","v":0},"12.","4400",null,null,{"$f":"Grundbuch!G95","v":0}]
[]
["Soll","2100 Unfertige Erzeugnisse",null,null,null,null,null,null,null,"Haben"]
["AB","8000",null,null,{"$f":"Bilanzbuch!C10","v":25000},"SB","8010",null,null,{"$f":"Grundbuch!G112","v":0}]
[{"$f":"IF(E45<J45,\"A\",\"\")","v":""},{"$f":"IF(E45<J45,5200,\"\")","v":""},null,null,{"$f":"IF(E45<J45,E47-E45,\"\")","v":""},{"$f":"IF(E45>J45,\"A\",\"\")","v":"A"},{"$f":"IF(J45<E45,5200,\"\")","v":5200},null,null,{"$f":"IF($E$45>$J$45,J47-J45,\"\")","v":25000}]
[null,null,null,null,{"$f":"IF($E$45>$J$45,$E$45,$J$45)","v":25000},null,null,null,null,{"$f":"IF($E$45>$J$45,$E$45,$J$45)","v":25000}]
[]
["Soll","2200 Fertige Erzeugnisse",null,null,null,null,null,null,null,"Haben"]
["AB","8000",null,null,{"$f":"Bilanzbuch!C11","v":8000},"SB","8010",null,null,{"$f":"Grundbuch!G113","v":0}]
[{"$f":"IF(E50<J50,\"A\",\"\")","v":""},{"$f":"IF(E50<J50,5200,\"\")","v":""},null,null,{"$f":"IF(E50<E52,E52-E50,\"\")","v":""},{"$f":"IF(J50<E50,\"A\",\"\")","v":"A"},{"$f":"IF(J50<E50,5200,\"\")","v":5200},null,null,{"$f":"IF(J50<E50,J52-J50,\"\")","v":8000}]
[null,null,null,null,{"$f":"IF(E50>J50,E50,J50)","v":8000},null,null,null,null,{"$f":"IF(E50>J50,E50,J50)","v":8000}]
[]
["Soll","2400 Forderungen aus Lieferungen und Leistungen",null,null,null,null,null,null,null,"Haben"]
["AB","8000",null,null,{"$f":"Bilanzbuch!C12","v":15000},"10.","2800","5001",4800,{"$f":"Grundbuch!G78","v":0}]
["8.","5000","4800",null,{"$f":"Grundbuch!D63","v":0},"SB",8010,null,null,{"$f":"J57-J55","v":15000}]
[null,null,null,null,{"$f":"SUM(E55:E56)","v":15000},null,null,null,null,{"$f":"E57","v":15000}]
[]
["Soll","2600 Vorsteuer",null,null,null,null,null,null,null,"Haben"]
["2.","4400",null,null,{"$f":"Grundbuch!D18","v":0},"5.","4400",null,null,{"$f":"Grundbuch!G41","v":0}]
{"$rows_left_out":66}
{"sheet":"GuV","index":3,"n_rows":10,"n_cols":6,"rows_kept":10,"cut":false,"hidden":false,"merged":[[0,0,0,5],[2,1,2,4]]}
["Gewinn- und Verlustrechnung"]
[]
["Soll","8020 Gewinn und Verlust",null,null,null,"Haben"]
["5200",{"$f":"VLOOKUP(A4,Kontenplan!$A$4:$B$33,2)","v":"Bestandsveränderungen"},{"$f":"IF(Hauptbuch!J112>0,Hauptbuch!J112,0)","v":33000},"5000",{"$f":"VLOOKUP(D4,Kontenplan!$A$4:$B$33,2)","v":"Umsatzerlöse"},{"$f":"Hauptbuch!E103","v":0}]
["6000",{"$f":"VLOOKUP(A5,Kontenplan!$A$4:$B$33,2)","v":"Aufwendungen für Rohstoffe"},{"$f":"Hauptbuch!J116","v":0},"5200",{"$f":"VLOOKUP(D5,Kontenplan!$A$4:$B$33,2)","v":"Bestandsveränderungen"},{"$f":"IF(Hauptbuch!E112>0,Hauptbuch!E112,0)","v":0}]
["6020",{"$f":"VLOOKUP(A6,Kontenplan!$A$4:$B$33,2)","v":"Aufwendungen für Hilfsstoffe"},{"$f":"Hauptbuch!J119","v":0}]
["6030",{"$f":"VLOOKUP(A7,Kontenplan!$A$4:$B$33,2)","v":"Aufwendungen für Betriebsstoffe"},{"$f":"Hauptbuch!J122","v":0}]
["6200",{"$f":"VLOOKUP(A8,Kontenplan!$A$4:$B$33,2)","v":"Löhne"},{"$f":"Hauptbuch!J125","v":0}]
[{"$f":"IF(SUM($F$4:$F$7)>SUM($C$4:$C$8),\"3000\",\"\")","v":""},{"$f":"IF(SUM($F$4:$F$7)>SUM($C$4:$C$8),\"Eigenkapital\",\"\")","v":""},{"$f":"IF(SUM($F$4:$F$7)>SUM($C$4:$C$8),SUM($F$4:$F$7)-SUM($C$4:$C$8),0)","v":0},{"$f":"IF(SUM($F$4:$F$7)>SUM($C$4:$C$8),\"\",\"3000\")","v":"3000"},{"$f":"IF(SUM($F$4:$F$7)>SUM($C$4:$C$8),\"\",\"Eigenkapital\")","v":"Eigenkapital"},{"$f":"IF(SUM($C$4:$C$8)>SUM($F$4:$F$5),SUM($C$4:$C$8)-SUM($F$4:$F$5),0)","v":33000}]
[null,null,{"$f":"IF(SUM($F$4:$F$7)>SUM($C$4:$C$8),SUM($F$4:$F$7),SUM($C$4:$C$8))","v":33000},null,null,{"$f":"SUM(F4:F9)","v":33000}]

{"sheet":"Bilanzbuch","index":4,"n_rows":29,"n_cols":6,"rows_kept":29,"cut":false,"hidden":false,"merged":[[2,1,2,4],[0,0,0,5],[16,1,16,4]]}
["Bilanzbuch"]
[]
["Aktiva","8000 Eröffnungsbilanz",null,null,null,"Passiva"]
["0500",{"$f":"VLOOKUP(A4,Kontenplan!$A$4:$B$33,2)","v":"Grundstücke und Bauten"},100000,"3000",{"$f":"VLOOKUP(D4,Kontenplan!$A$4:$B$33,2)","v":"Eigenkapital"},{"$f":"F15-SUM(F5:F14)","v":356000}]
["0700",{"$f":"VLOOKUP(A5,Kontenplan!$A$4:$B$33,2)","v":"Technische Anlagen und Maschinen"},80000,"4400",{"$f":"VLOOKUP(D5,Kontenplan!$A$4:$B$33,2)","v":"Verbindlichkeiten a.L.u.L."},20000]
["0800",{"$f":"VLOOKUP(A6,Kontenplan!$A$4:$B$33,2)","v":"Beriebs- und Geschäftsausstattung"},20000,"4800",{"$f":"VLOOKUP(D6,Kontenplan!$A$4:$B$33,2)","v":"Umsatzsteuer"},4000]
["2000",{"$f":"VLOOKUP(A7,Kontenplan!$A$4:$B$33,2)","v":"Rohstoffe"},40000]
["2020",{"$f":"VLOOKUP(A8,Kontenplan!$A$4:$B$33,2)","v":"Hilfsstoffe"},8000]
["2030",{"$f":"VLOOKUP(A9,Kontenplan!$A$4:$B$33,2)","v":"Betriebsstoffe"},3000]
["2100",{"$f":"VLOOKUP(A10,Kontenplan!$A$4:$B$33,2)","v":"Unfertige Erzeugnisse"},25000]
["2200",{"$f":"VLOOKUP(A11,Kontenplan!$A$4:$B$33,2)","v":"Fertige Erzeugnisse"},8000]
["2400",{"$f":"VLOOKUP(A12,Kontenplan!$A$4:$B$33,2)","v":"Forderungen a.L.u.L."},15000]
["2800",{"$f":"VLOOKUP(A13,Kontenplan!$A$4:$B$33,2)","v":"Kreditinstitute/Bank"},75000]
["2880",{"$f":"VLOOKUP(A14,Kontenplan!$A$4:$B$33,2)","v":"Kasse"},6000]
[null,null,{"$f":"SUM(C4:C14)","v":380000},null,null,{"$f":"C15","v":380000}]
[]
["Aktiva","8010 Schlussbilanz",null,null,null,"Passiva"]
["0500",{"$f":"VLOOKUP(A18,Kontenplan!$A$4:$B$33,2)","v":"Grundstücke und Bauten"},{"$f":"Hauptbuch!J4","v":100000},"3000",{"$f":"VLOOKUP(D18,Kontenplan!$A$4:$B$33,2)","v":"Eigenkapital"},{"$f":"Hauptbuch!E84","v":323000}]
["0700",{"$f":"VLOOKUP(A19,Kontenplan!$A$4:$B$33,2)","v":"Technische Anlagen und Maschinen"},{"$f":"Hauptbuch!J7","v":80000},"4400",{"$f":"VLOOKUP(D19,Kontenplan!$A$4:$B$33,2)","v":"Verbindlichkeiten a.L.u.L."},{"$f":"Hauptbuch!E91","v":20000}]
["0800",{"$f":"VLOOKUP(A20,Kontenplan!$A$4:$B$33,2)","v":"Beriebs- und Geschäftsausstattung"},{"$f":"Hauptbuch!J10","v":20000},"4800",{"$f":"VLOOKUP(D20,Kontenplan!$A$4:$B$33,2)","v":"Umsatzsteuer"},{"$f":"Hauptbuch!E98","v":4000}]
["2000",{"$f":"VLOOKUP(A21,Kontenplan!$A$4:$B$33,2)","v":"Rohstoffe"},{"$f":"Hauptbuch!J17","v":40000}]
["2020",{"$f":"VLOOKUP(A22,Kontenplan!$A$4:$B$33,2)","v":"Hilfsstoffe"},{"$f":"Hauptbuch!J29","v":8000}]
["2030",{"$f":"VLOOKUP(A23,Kontenplan!$A$4:$B$33,2)","v":"Betriebsstoffe"},{"$f":"Hauptbuch!J38","v":3000}]
["2100",{"$f":"VLOOKUP(A24,Kontenplan!$A$4:$B$33,2)","v":"Unfertige Erzeugnisse"},{"$f":"Grundbuch!D112","v":0}]
["2200",{"$f":"VLOOKUP(A25,Kontenplan!$A$4:$B$33,2)","v":"Fertige Erzeugnisse"},{"$f":"Grundbuch!D113","v":0}]
["2400",{"$f":"VLOOKUP(A26,Kontenplan!$A$4:$B$33,2)","v":"Forderungen a.L.u.L."},{"$f":"Hauptbuch!J56","v":15000}]
["2800",{"$f":"VLOOKUP(A27,Kontenplan!$A$4:$B$33,2)","v":"Kreditinstitute/Bank"},{"$f":"Hauptbuch!J73","v":75000}]
["2880",{"$f":"VLOOKUP(A28,Kontenplan!$A$4:$B$33,2)","v":"Kasse"},{"$f":"Hauptbuch!J79","v":6000}]
[null,null,{"$f":"SUM(C18:C28)","v":347000},null,null,{"$f":"SUM(F18:F28)","v":347000}]

{"sheet":"Kontenplan","index":5,"n_rows":33,"n_cols":2,"rows_kept":33,"cut":false,"hidden":false,"merged":[]}
[null,"Kontenplan"]
[]
["Nr.","Konto"]
["0500","Grundstücke und Bauten"]
["0700","Technische Anlagen und Maschinen"]
["0800","Beriebs- und Geschäftsausstattung"]
["2000","Rohstoffe"]
["2001","Bezugskosten (Rohstoffe)"]
["2002","Nachlässe (Rohstoffe)"]
["2020","Hilfsstoffe"]
["2022","Nachlässe (Hilfsstoffe)"]
["2030","Betriebsstoffe"]
["2032","Nachlässe (Betriebsstoffe)"]
["2100","Unfertige Erzeugnisse"]
["2200","Fertige Erzeugnisse"]
["2400","Forderungen a.L.u.L."]
["2600","Vorsteuer"]
["2800","Kreditinstitute/Bank"]
["2880","Kasse"]
["3000","Eigenkapital"]
["4400","Verbindlichkeiten a.L.u.L."]
["4800","Umsatzsteuer"]
["5000","Umsatzerlöse"]
["5001","Erlösberichtigungen"]
["5200","Bestandsveränderungen"]
["6000","Aufwendungen für Rohstoffe"]
["6020","Aufwendungen für Hilfsstoffe"]
["6030","Aufwendungen für Betriebsstoffe"]
["6200","Löhne"]
["6520","Abschreibungen auf Sachanlagen"]
["8000","Eröffnungsbilanz"]
["8010","Schlussbilanz"]
["8020","Gewinn und Verlust"]