{"text_format":"1","workbook":"xlsx","n_sheets":6,"sheets":["Hinweise","Grundbuch","Hauptbuch","GuV","Bilanzbuch","Kontenplan"],"not_rendered":{"charts":0,"images":17,"macros":1,"external_links":0,"defined_names":0,"comments":0,"pivot_tables":0},"unopened":[],"bounds":{"document_bytes":16777216,"sheet_cells":100000,"rows_first":2000,"rows_last":500,"rows_between":2000,"halvings":0,"cell_chars":16384,"cell_head_chars":4096},"cells_cut":0,"cells_raw":0,"read":"whole","date_system":"1900"}

{"sheet":"Hinweise","index":0,"n_rows":26,"n_cols":1,"rows_kept":26,"cut":false,"hidden":false,"merged":[[0,0,0,7],[2,0,2,1]]}
["Geschäftsgang 4"]
[]
["Voraussetzungen"]
["Um den Geschäftsgang buchen zu können müssen Sie Kenntnisse über die folgenden Lehrninhalte haben:"]
["Buchungen auf Bestandskonten"]
["Buchungen auf Erfolgskonten"]
["Bestandsveränderungen"]
["Umsatzsteuer"]
[]
["Vorgehensweise"]
["1. Wählen Sie die Tabelle \"Grundbuch\"."]
[]
["2. Buchen Sie die Geschäftsvorfälle"]
["    entweder durch Direkteingabe in die entsprechenden Felder des Grundbuchs (Kontennummern und Beträge)"]
["    oder durch Aufruf von Buchungsfenstern. (Klicken Sie dazu jeweils auf die Schaltfläche \"Buchung\" und beenden"]
["    Sie die Eingabe  mit \"OK\".)"]
["    Die Kontennummern sind vierstellig anzugeben. (siehe Kontenplan). Bei zusammengesetzten Buchungssätzen"]
["    sind die Buchungen nach der Höhe der Beträge geordnet vorzunehmen. "]
[]
["3. Sie können sich den Kontenplan mit Kontennummern jederzeit durch Klick auf den"]
["    entsprechenden Button anzeigen lassen."]
[]
["4. Die Richtigkeit Ihrer Buchungen wird bestätigt oder Sie werden auf"]
["    Fehler hingewiesen. (Ohne Buchung werden Fehler angezeigt.)"]
[]
["5. Hauptbuch, Gewinn und Verlust und Bilanzbuch werden automatisch erstellt. "]

{"sheet":"Grundbuch","index":1,"n_rows":100,"n_cols":7,"rows_kept":100,"cut":false,"hidden":false,"merged":[[99,0,99,6],[1,0,1,4],[2,0,2,4],[91,0,91,2],[93,5,93,6],[94,5,94,6],[96,0,97,0],[92,5,92,6],[5,1,7,2],[5,5,5,6],[13,5,13,6],[14,5,14,6],[16,0,17,0],[19,5,19,6],[6,5,6,6],[7,5,7,6],[9,0,10,0],[12,5,12,6],[20,5,20,6],[21,5,21,6],[23,0,24,0],[23,1,24,1],[23,2,24,2],[23,3,24,3],[23,4,24,4],[23,5,24,5],[23,6,24,6],[19,1,21,3],[38,0,40,0],[26,5,26,6],[27,5,27,6],[28,5,28,6],[30,0,31,0],[26,1,28,2],[42,1,44,3],[42,5,42,6],[43,5,43,6],[44,5,44,6],[33,5,34,6],[35,5,35,6],[36,5,36,6],[50,5,50,6],[51,5,51,6],[46,0,47,0],[46,1,47,1],[46,2,47,2],[46,3,47,3],[53,0,54,0],[56,1,58,2],[56,5,56,6],[57,5,57,6],[58,5,58,6],[46,4,47,4],[46,5,47,5],[46,6,47,6],[49,1,51,2],[49,5,49,6],[70,5,70,6],[71,5,71,6],[72,5,72,6],[60,0,61,0],[63,5,63,6],[64,5,64,6],[65,5,65,6],[74,0,75,0],[74,1,75,1],[74,2,75,2],[74,3,75,3],[67,0,68,0],[70,1,72,3],[74,4,75,4],[74,5,75,5],[74,6,75,6],[77,1,79,2],[77,5,77,6],[78,5,78,6],[79,5,79,6],[88,0,89,0],[81,0,82,0],[84,1,86,2],[84,5,84,6],[85,5,85,6],[86,5,86,6]]}
[]
["Geschäftsvorfälle"]
["Grundbuch"]
[null,null,null,null,null,null,0.19]
[]
["1.","Zieleinkauf von Baumwollstoffen,",null,"netto",18500,{"$f":"IF(AND(B10=\"2000\",B11=\"2600\",E10=\"4400\"),\"Die Konten sind richtig!\",\"Mindestens ein Konto ist falsch!\")","v":"Mindestens ein Konto ist falsch!"}]
["Geschäftsvorfall",null,null,"USt.",{"$f":"E6*G4","v":3515},{"$f":"IF(AND(D10=E6,D11=E7,G10=E8),\"Die Beträge sind richtig!\",\"Mindestens ein Betrag ist falsch!\")","v":"Mindestens ein Betrag ist falsch!"}]
[null,null,null,"brutto",{"$f":"SUM(E6:E7)","v":22015},{"$f":"IF(AND(F6=\"Die Konten sind richtig!\",F7=\"Die Beträge sind richtig!\"),\"Alles richtig!\",\"Es sind noch Fehler vorhanden!\")","v":"Es sind noch Fehler vorhanden!"}]
[null,"Soll","Konto","€","Haben","Konto","€"]
["Buchungssatz","",{"$f":"IF(B10=\"\",\"\",VLOOKUP(B10,Kontenplan!$A$4:$B$35,2))","v":""},null,"",{"$f":"IF(E10=\"\",\"\",VLOOKUP(E10,Kontenplan!$A$4:$B$35,2))","v":""}]
[null,"",{"$f":"IF(B11=\"\",\"\",VLOOKUP(B11,Kontenplan!$A$4:$B$35,2))","v":""}]
[]
["2.","Banküberweisung für - Löhne",null,null,22500,{"$f":"IF(AND(B17=\"6200\",B18=\"6300\",E17=\"2800\"),\"Die Konten sind richtig!\",\"Mindestens ein Konto ist falsch!\")","v":"Mindestens ein Konto ist falsch!"}]
["Geschäftsvorfall",null,"           - Gehälter",null,32600,{"$f":"IF(AND(D17=E13,D18=E14,G17=E15),\"Die Beträge sind richtig!\",\"Mindestens ein Betrag ist falsch!\")","v":"Mindestens ein Betrag ist falsch!"}]
[null,null,"             Banklastschrift",null,{"$f":"SUM(E13:E14)","v":55100},{"$f":"IF(AND(F13=\"Die Konten sind richtig!\",F14=\"Die Beträge sind richtig!\"),\"Alles richtig!\",\"Es sind noch Fehler vorhanden!\")","v":"Es sind noch Fehler vorhanden!"}]
[null,"Soll","Konto","€","Haben","Konto","€"]
["Buchungssatz","",{"$f":"IF(B17=\"\",\"\",VLOOKUP(B17,Kontenplan!$A$4:$B$35,2))","v":""},null,"",{"$f":"IF(E17=\"\",\"\",VLOOKUP(E17,Kontenplan!$A$4:$B$35,2))","v":""}]
[null,"",{"$f":"IF(B18=\"\",\"\",VLOOKUP(B18,Kontenplan!$A$4:$B$35,2))","v":""}]
[]
["3.","Die Boutique Simone Sommer begleicht eine Ausgangsrechnung durch Banküberweisung,",null,null,4200,{"$f":"IF(AND(B24=\"2800\",E24=\"2400\"),\"Die Konten sind richtig!\",\"Mindestens ein Konto ist falsch!\")","v":"Mindestens ein Konto ist falsch!"}]
["Geschäftsvorfall",null,null,null,null,{"$f":"IF(AND(D24=E20,G24=E20),\"Die Beträge sind richtig!\",\"Mindestens ein Betrag ist falsch!\")","v":"Mindestens ein Betrag ist falsch!"}]
[null,null,null,null,null,{"$f":"IF(AND(F20=\"Die Konten sind richtig!\",F21=\"Die Beträge sind richtig!\"),\"Alles richtig!\",\"Es sind noch Fehler vorhanden!\")","v":"Es sind noch Fehler vorhanden!"}]
[null,"Soll","Konto","€","Haben","Konto","€"]
["Buchungssatz","",{"$f":"IF(B24=\"\",\"\",VLOOKUP(B24,Kontenplan!$A$4:$B$35,2))","v":""},null,"",{"$f":"IF(E24=\"\",\"\",VLOOKUP(E24,Kontenplan!$A$4:$B$35,2))","v":""}]
[]
[]
["4.","Barzahlung für eine Kfz-Reparatur,",null,"netto",1100,{"$f":"IF(AND(B31=\"6160\",B32=\"2600\",E31=\"2880\"),\"Die Konten sind richtig!\",\"Mindestens ein Konto ist falsch!\")","v":"Mindestens ein Konto ist falsch!"}]
["Geschäftsvorfall",null,null,"USt.",{"$f":"E27*G4","v":209},{"$f":"IF(AND(D31=E27,D32=E28,G31=E29),\"Die Beträge sind richtig!\",\"Mindestens ein Betrag ist falsch!\")","v":"Mindestens ein Betrag ist falsch!"}]
[null,null,null,"brutto",{"$f":"SUM(E27:E28)","v":1309},{"$f":"IF(AND(F27=\"Die Konten sind richtig!\",F28=\"Die Beträge sind richtig!\"),\"Alles richtig!\",\"Es sind noch Fehler vorhanden!\")","v":"Es sind noch Fehler vorhanden!"}]
[null,"Soll","Konto","€","Haben","Konto","€"]
["Buchungssatz","",{"$f":"IF(B31=\"\",\"\",VLOOKUP(B31,Kontenplan!$A$4:$B$35,2))","v":""},null,"",{"$f":"IF(E31=\"\",\"\",VLOOKUP(E31,Kontenplan!$A$4:$B$35,2))","v":""}]
[null,"",{"$f":"IF(B32=\"\",\"\",VLOOKUP(B32,Kontenplan!$A$4:$B$35,2))","v":""}]
[]
["5.","Verbrauch lt. Materialentnahmescheine für",null,null,null,{"$f":"IF(AND(B39=\"6000\",E39=\"2000\",B40=\"6020\",E40=\"2020\",B41=\"6030\",E41=\"2030\"),\"Die Konten sind richtig!\",\"Mindestens ein Konto ist falsch!\")","v":"Mindestens ein Konto ist falsch!"}]
["Geschäftsvorfall",null,"           - Baumwolle",null,8300]
[null,null,"           - Reißverschlüsse",null,820,{"$f":"IF(AND(D39=E35,D40=E36,D41=E37,G39=E35,G40=E36,G41=E37),\"Die Beträge sind richtig!\",\"Mindestens ein Betrag ist falsch!\")","v":"Mindestens ein Betrag ist falsch!"}]
[null,null,"           - Schmierstoffe",null,220,{"$f":"IF(AND(F34=\"Die Konten sind richtig!\",F36=\"Die Beträge sind richtig!\"),\"Alles richtig!\",\"Es sind noch Fehler vorhanden!\")","v":"Es sind noch Fehler vorhanden!"}]
[null,"Soll","Konto","€","Haben","Konto","€"]
["Buchungssatz","",{"$f":"IF(B39=\"\",\"\",VLOOKUP(B39,Kontenplan!$A$4:$B$35,2))","v":""},null,"",{"$f":"IF(E39=\"\",\"\",VLOOKUP(E39,Kontenplan!$A$4:$B$35,2))","v":""}]
[null,"",{"$f":"IF(B40=\"\",\"\",VLOOKUP(B40,Kontenplan!$A$4:$B$35,2))","v":""},null,"",{"$f":"IF(E40=\"\",\"\",VLOOKUP(E40,Kontenplan!$A$4:$B$35,2))","v":""}]
[null,"",{"$f":"IF(B41=\"\",\"\",VLOOKUP(B41,Kontenplan!$A$4:$B$35,2))","v":""},null,"",{"$f":"IF(E41=\"\",\"\",VLOOKUP(E41,Kontenplan!$A$4:$B$35,2))","v":""}]
[]
["6.","Die ZIP GmbH belastet uns mit Zinsen,",null,null,60,{"$f":"IF(AND(B47=\"7510\",E47=\"4400\"),\"Die Konten sind richtig!\",\"Mindestens ein Konto ist falsch!\")","v":"Mindestens ein Konto ist falsch!"}]
["Geschäftsvorfall",null,null,null,null,{"$f":"IF(AND(D47=E43,G47=E43),\"Die Beträge sind richtig!\",\"Mindestens ein Betrag ist falsch!\")","v":"Mindestens ein Betrag ist falsch!"}]
[null,null,null,null,null,{"$f":"IF(AND(F43=\"Die Konten sind richtig!\",F44=\"Die Beträge sind richtig!\"),\"Alles richtig!\",\"Es sind noch Fehler vorhanden!\")","v":"Es sind noch Fehler vorhanden!"}]
[null,"Soll","Konto","€","Haben","Konto","€"]
["Buchungssatz","",{"$f":"IF(B47=\"\",\"\",VLOOKUP(B47,Kontenplan!$A$4:$B$35,2))","v":""},null,"",{"$f":"IF(E47=\"\",\"\",VLOOKUP(E47,Kontenplan!$A$4:$B$35,2))","v":""}]
[]
[]
["7.","Zieleinkauf eines PC's,",null,"netto",1450,{"$f":"IF(AND(B54=\"0800\",B55=\"2600\",E54=\"4400\"),\"Die Konten sind richtig!\",\"Mindestens ein Konto ist falsch!\")","v":"Mindestens ein Konto ist falsch!"}]
["Geschäftsvorfall",null,null,"USt.",{"$f":"E50*G4","v":275.5},{"$f":"IF(AND(D54=E50,D55=E51,G54=E52),\"Die Beträge sind richtig!\",\"Mindestens ein Betrag ist falsch!\")","v":"Mindestens ein Betrag ist falsch!"}]
[null,null,null,"brutto",{"$f":"SUM(E50:E51)","v":1725.5},{"$f":"IF(AND(F50=\"Die Konten sind richtig!\",F51=\"Die Beträge sind richtig!\"),\"Alles richtig!\",\"Es sind noch Fehler vorhanden!\")","v":"Es sind noch Fehler vorhanden!"}]
[null,"Soll","Konto","€","Haben","Konto","€"]
["Buchungssatz","",{"$f":"IF(B54=\"\",\"\",VLOOKUP(B54,Kontenplan!$A$4:$B$35,2))","v":""},null,"",{"$f":"IF(E54=\"\",\"\",VLOOKUP(E54,Kontenplan!$A$4:$B$35,2))","v":""}]
[null,"",{"$f":"IF(B55=\"\",\"\",VLOOKUP(B55,Kontenplan!$A$4:$B$35,2))","v":""}]
[]
["8.","Verkauf von Badeanzügen gegen Banküberweisung,",null,"netto",45600,{"$f":"IF(AND(B61=\"2800\",E61=\"5000\",E62=\"4800\"),\"Die Konten sind richtig!\",\"Mindestens ein Konto ist falsch!\")","v":"Mindestens ein Konto ist falsch!"}]
["Geschäftsvorfall",null,null,"USt.",{"$f":"E57*G4","v":8664},{"$f":"IF(AND(D61=E59,G61=E57,G62=E58),\"Die Beträge sind richtig!\",\"Mindestens ein Betrag ist falsch!\")","v":"Mindestens ein Betrag ist falsch!"}]
[null,null,null,"brutto",{"$f":"SUM(E57:E58)","v":54264},{"$f":"IF(AND(F57=\"Die Konten sind richtig!\",F58=\"Die Beträge sind richtig!\"),\"Alles richtig!\",\"Es sind noch Fehler vorhanden!\")","v":"Es sind noch Fehler vorhanden!"}]
[null,"Soll","Konto","€","Haben","Konto","€"]
["Buchungssatz","",{"$f":"IF(B61=\"\",\"\",VLOOKUP(B61,Kontenplan!$A$4:$B$35,2))","v":""},null,"",{"$f":"IF(E61=\"\",\"\",VLOOKUP(E61,Kontenplan!$A$4:$B$35,2))","v":""}]
[null,null,null,null,"",{"$f":"IF(E62=\"\",\"\",VLOOKUP(E62,Kontenplan!$A$4:$B$35,2))","v":""}]
[]
["9.","Banklastschrift für - Steuern",null,null,1550,{"$f":"IF(AND(B68=\"7000\",B69=\"7510\",E68=\"2800\"),\"Die Konten sind richtig!\",\"Mindestens ein Konto ist falsch!\")","v":"Mindestens ein Konto ist falsch!"}]
["Geschäftsvorfall",null,"       - Darlehenszinsen",null,560,{"$f":"IF(AND(D68=E64,D69=E65,G68=E66),\"Die Beträge sind richtig!\",\"Mindestens ein Betrag ist falsch!\")","v":"Mindestens ein Betrag ist falsch!"}]
[null,null,"         Banklastschrift",null,{"$f":"E64+E65","v":2110},{"$f":"IF(AND(F64=\"Die Konten sind richtig!\",F65=\"Die Beträge sind richtig!\"),\"Alles richtig!\",\"Es sind noch Fehler vorhanden!\")","v":"Es sind noch Fehler vorhanden!"}]
[null,"Soll","Konto","€","Haben","Konto","€"]
["Buchungssatz","",{"$f":"IF(B68=\"\",\"\",VLOOKUP(B68,Kontenplan!$A$4:$B$35,2))","v":""},null,"",{"$f":"IF(E68=\"\",\"\",VLOOKUP(E68,Kontenplan!$A$4:$B$35,2))","v":""}]
[null,"",{"$f":"IF(B69=\"\",\"\",VLOOKUP(B69,Kontenplan!$A$4:$B$35,2))","v":""}]
[]
["10.","Barzahlung für Postwertzeichen,",null,null,100,{"$f":"IF(AND(B75=\"6820\",E75=\"2880\"),\"Die Konten sind richtig!\",\"Mindestens ein Konto ist falsch!\")","v":"Mindestens ein Konto ist falsch!"}]
["Geschäftsvorfall",null,null,null,null,{"$f":"IF(AND(D75=E71,G75=E71),\"Die Beträge sind richtig!\",\"Mindestens ein Betrag ist falsch!\")","v":"Mindestens ein Betrag ist falsch!"}]
[null,null,null,null,null,{"$f":"IF(AND(F71=\"Die Konten sind richtig!\",F72=\"Die Beträge sind richtig!\"),\"Alles richtig!\",\"Es sind noch Fehler vorhanden!\")","v":"Es sind noch Fehler vorhanden!"}]
[null,"Soll","Konto","€","Haben","Konto","€"]
["Buchungssatz","",{"$f":"IF(B75=\"\",\"\",VLOOKUP(B75,Kontenplan!$A$4:$B$35,2))","v":""},null,"",{"$f":"IF(E75=\"\",\"\",VLOOKUP(E75,Kontenplan!$A$4:$B$35,2))","v":""}]
[]
[]
["11.","Barverkauf eines gebrauchten PC, ",null,"netto",400,{"$f":"IF(AND(B82=\"2880\",E82=\"0800\",E83=\"4800\"),\"Die Konten sind richtig!\",\"Mindestens ein Konto ist falsch!\")","v":"Mindestens ein Konto ist falsch!"}]
["Geschäftsvorfall",null,null,"USt.",{"$f":"E78*G4","v":76},{"$f":"IF(AND(D82=E80,G82=E78,G83=E79),\"Die Beträge sind richtig!\",\"Mindestens ein Betrag ist falsch!\")","v":"Mindestens ein Betrag ist falsch!"}]
[null,null,null,"brutto",{"$f":"SUM(E78:E79)","v":476},{"$f":"IF(AND(F78=\"Die Konten sind richtig!\",F79=\"Die Beträge sind richtig!\"),\"Alles richtig!\",\"Es sind noch Fehler vorhanden!\")","v":"Es sind noch Fehler vorhanden!"}]
{"$rows_left_out":21}
{"sheet":"Hauptbuch","index":2,"n_rows":125,"n_cols":10,"rows_kept":125,"cut":false,"hidden":false,"merged":[[106,1,106,8],[100,1,100,8],[103,1,103,8],[13,1,13,8],[69,1,69,8],[86,1,86,8],[91,1,91,8],[58,1,58,8],[64,1,64,8],[72,1,72,8],[52,1,52,8],[16,1,16,8],[21,1,21,8],[26,1,26,8],[31,1,31,8],[97,1,97,8],[79,1,79,8],[36,1,36,8],[41,1,41,8],[121,1,121,8],[109,1,109,8],[112,1,112,8],[118,1,118,8],[115,1,115,8],[0,0,0,9],[2,1,2,8],[5,1,5,8],[8,1,8,8],[46,1,46,8]]}
["Hauptbuch"]
[]
["Soll","0510 Bebaute Grundstücke",null,null,null,null,null,null,null,"Haben"]
["AB","8000",null,null,{"$f":"Bilanzbuch!C4","v":330000},"SB",8010,null,null,{"$f":"E4","v":330000}]
[]
["Soll","0700 Technische Anlagen und Maschinen",null,null,null,null,null,null,null,"Haben"]
["AB","8000",null,null,{"$f":"Bilanzbuch!C5","v":380500},"SB",8010,null,null,{"$f":"E7","v":380500}]
[]
["Soll","0800 Betriebs- und Geschäftsausstattung",null,null,null,null,null,null,null,"Haben"]
["AB","8000",null,null,{"$f":"Bilanzbuch!C6","v":54900},"11.",2880,null,null,{"$f":"Grundbuch!G82","v":0}]
["7.",4400,null,null,{"$f":"Grundbuch!D54","v":0},"SB",8010,null,null,{"$f":"J12-J10","v":54900}]
[null,null,null,null,{"$f":"SUM(E10:E11)","v":54900},null,null,null,null,{"$f":"E12","v":54900}]
[]
["Soll","0840 Fuhrpark",null,null,null,null,null,null,null,"Haben"]
["AB","8000",null,null,{"$f":"Bilanzbuch!C7","v":116000},"SB",8010,null,null,{"$f":"E15","v":116000}]
[]
["Soll","2000 Rohstoffe",null,null,null,null,null,null,null,"Haben"]
["AB","8000",null,null,{"$f":"Bilanzbuch!C8","v":200000},"5.","6000",null,null,{"$f":"Grundbuch!G39","v":0}]
["1.","4400",null,null,{"$f":"Grundbuch!D10","v":0},"SB",8010,null,null,{"$f":"J20-J18","v":200000}]
[null,null,null,null,{"$f":"SUM(E18:E19)","v":200000},null,null,null,null,{"$f":"E20","v":200000}]
[]
["Soll","2020 Hilfsstoffe",null,null,null,null,null,null,null,"Haben"]
["AB","8000",null,null,{"$f":"Bilanzbuch!C9","v":22500},"5.","6020",null,null,{"$f":"Grundbuch!G40","v":0}]
[null,null,null,null,null,"SB",8010,null,null,{"$f":"J25-J23","v":22500}]
[null,null,null,null,{"$f":"SUM(E23:E24)","v":22500},null,null,null,null,{"$f":"E25","v":22500}]
[]
["Soll","2030 Betriebsstoffe",null,null,null,null,null,null,null,"Haben"]
["AB","8000",null,null,{"$f":"Bilanzbuch!C10","v":6700},"5.","6030",null,null,{"$f":"Grundbuch!G41","v":0}]
[null,null,null,null,null,"SB",8010,null,null,{"$f":"J30-J28","v":6700}]
[null,null,null,null,{"$f":"SUM(E28:E29)","v":6700},null,null,null,null,{"$f":"E30","v":6700}]
[]
["Soll","2100 Unfertige Erzeugnisse",null,null,null,null,null,null,null,"Haben"]
["AB","8000",null,null,{"$f":"Bilanzbuch!C11","v":64500},"A1","8010",null,null,{"$f":"Grundbuch!G97","v":0}]
[{"$f":"IF(E33<J33,\"A\",\"\")","v":""},{"$f":"IF(E33<J33,5200,\"\")","v":""},null,null,{"$f":"IF(E33<J33,E35-E33,\"\")","v":""},{"$f":"IF(E33>J33,\"A\",\"\")","v":"A"},{"$f":"IF(J33<E33,5200,\"\")","v":5200},null,null,{"$f":"IF($E$33>$J$33,J35-J33,\"\")","v":64500}]
[null,null,null,null,{"$f":"IF($E$33>$J$33,$E$33,$J$33)","v":64500},null,null,null,null,{"$f":"IF($E$33>$J$33,$E$33,$J$33)","v":64500}]
[]
["Soll","2200 Fertige Erzeugnisse",null,null,null,null,null,null,null,"Haben"]
["AB","8000",null,null,{"$f":"Bilanzbuch!C12","v":19000},"A1","8010",null,null,{"$f":"Grundbuch!G98","v":0}]
[{"$f":"IF(E38<J38,\"A\",\"\")","v":""},{"$f":"IF(E38<J38,5200,\"\")","v":""},null,null,{"$f":"IF(E38<E40,E40-E38,\"\")","v":""},{"$f":"IF(J38<E38,\"A\",\"\")","v":"A"},{"$f":"IF(J38<E38,5200,\"\")","v":5200},null,null,{"$f":"IF(J38<E38,J40-J38,\"\")","v":19000}]
[null,null,null,null,{"$f":"IF(E38>J38,E38,J38)","v":19000},null,null,null,null,{"$f":"IF(E38>J38,E38,J38)","v":19000}]
[]
["Soll","2400 Forderungen aus Lieferungen und Leistungen",null,null,null,null,null,null,null,"Haben"]
["AB","8000",null,null,{"$f":"Bilanzbuch!C13","v":45600},"3.",2800,null,null,{"$f":"Grundbuch!G24","v":0}]
["12.","5000","4800",null,{"$f":"Grundbuch!D89","v":0},"SB",8010,null,null,{"$f":"J45-J43","v":45600}]
[null,null,null,null,{"$f":"SUM(E43:E44)","v":45600},null,null,null,null,{"$f":"E45","v":45600}]
[]
["Soll","2600 Vorsteuer",null,null,null,null,null,null,null,"Haben"]
["1.","4400",null,null,{"$f":"Grundbuch!D11","v":0},"SB",4800,null,null,{"$f":"J51","v":0}]
["4.","2880",null,null,{"$f":"Grundbuch!D32","v":0}]
["7.","4400",null,null,{"$f":"Grundbuch!D55","v":0}]
[null,null,null,null,{"$f":"SUM(E48:E50)","v":0},null,null,null,null,{"$f":"E51","v":0}]
[]
["Soll","2800 Kreditinstitute/Bank",null,null,null,null,null,null,null,"Haben"]
["AB","8000",null,null,{"$f":"Bilanzbuch!C14","v":112600},"2.","6200","6300",null,{"$f":"Grundbuch!G17","v":0}]
["3.","2400",null,null,{"$f":"Grundbuch!D24","v":0},"9.","7000",7510,null,{"$f":"Grundbuch!G68","v":0}]
["8.","5000",4800,null,{"$f":"Grundbuch!D61","v":0},"SB",8010,null,null,{"$f":"J57-J54-J55","v":112600}]
[null,null,null,null,{"$f":"SUM(E54:E56)","v":112600},null,null,null,null,{"$f":"E57","v":112600}]
[]
["Soll","2880 Kasse",null,null,null,null,null,null,null,"Haben"]
["AB","8000",null,null,{"$f":"Bilanzbuch!C15","v":9800},"4.","6160","2600",null,{"$f":"Grundbuch!G31","v":0}]
["11.","0800","4800",null,{"$f":"Grundbuch!D82","v":0},"10.","6820",null,null,{"$f":"Grundbuch!G75","v":0}]
[null,null,null,null,null,"SB",8010,null,null,{"$f":"J63-SUM(J60:J61)","v":9800}]
[null,null,null,null,{"$f":"SUM(E60:E62)","v":9800},null,null,null,null,{"$f":"E63","v":9800}]
[]
["Soll","3000 Eigenkapital",null,null,null,null,null,null,null,"Haben"]
[{"$f":"IF(GuV!$F$14>0,\"A\",\"\")","v":"A"},{"$f":"IF(GuV!$F$14>0,\"8020\",\"\")","v":"8020"},null,null,{"$f":"IF(GuV!$F$14>0,GuV!$F$14,0)","v":83500},"AB",8000,null,null,{"$f":"Bilanzbuch!F4","v":698100}]
["SB",8010,null,null,{"$f":"E68-E66","v":614600},{"$f":"IF(GuV!$C$14>0,\"A\",\"\")","v":""},{"$f":"IF(GuV!$C$14>0,\"8020\",\"\")","v":""},null,null,{"$f":"IF(GuV!$C$14>0,GuV!$C$14,0)","v":0}]
[null,null,null,null,{"$f":"J68","v":698100},null,null,null,null,{"$f":"SUM(J66:J67)","v":698100}]
[]
["Soll","4200 Verbindlichkeiten gegenüber Kreditinstituten (Darlehen)",null,null,null,null,null,null,null,"Haben"]
["SB","8010",null,null,{"$f":"J71","v":534000},"AB",8000,null,null,{"$f":"Bilanzbuch!F5","v":534000}]
[]
["Soll","4400 Verbindlichkeiten aus Lieferungen und Leistungen",null,null,null,null,null,null,null,"Haben"]
["SB",8010,null,null,{"$f":"E78","v":118900},"AB",8000,null,null,{"$f":"Bilanzbuch!F6","v":118900}]
[null,null,null,null,null,"1.","2000","2600",null,{"$f":"Grundbuch!G10","v":0}]
[null,null,null,null,null,"6.","7510",null,null,{"$f":"Grundbuch!G47","v":0}]
[null,null,null,null,null,"7.","0800","2600",null,{"$f":"Grundbuch!G54","v":0}]
[null,null,null,null,{"$f":"J78","v":118900},null,null,null,null,{"$f":"SUM(J74:J77)","v":118900}]
[]
["Soll","4800 Umsatzsteuer",null,null,null,null,null,null,null,"Haben"]
{"$rows_left_out":46}
{"sheet":"GuV","index":3,"n_rows":15,"n_cols":6,"rows_kept":15,"cut":false,"hidden":false,"merged":[[0,0,0,5],[2,1,2,4]]}
["Gewinn- und Verlustrechnung"]
[]
["Soll","8020 Gewinn und Verlust",null,null,null,"Haben"]
["5200","Bestandsveränderungen",{"$f":"IF(Hauptbuch!J95>0,Hauptbuch!J95,0)","v":83500},"5000","Umsatzerlöse",{"$f":"Hauptbuch!E88","v":0}]
["6000","Aufwendungen für Rohstoffe",{"$f":"Hauptbuch!J99","v":0},5200,"Bestandsveränderungen",{"$f":"IF(Hauptbuch!E95>0,Hauptbuch!E95,0)","v":0}]
["6020","Aufwendungen für Hilfsstoffe",{"$f":"Hauptbuch!E102","v":0}]
["6030","Aufwendungen für Betriebsstoffe",{"$f":"Hauptbuch!J105","v":0}]
["6160","Fremdinstandhaltung",{"$f":"Hauptbuch!J108","v":0}]
["6200","Löhne",{"$f":"Hauptbuch!J111","v":0}]
["6300","Gehälter",{"$f":"Hauptbuch!J114","v":0}]
["8820","Portokosten",{"$f":"Hauptbuch!J117","v":0}]
["7000","Betriebliche Steuern",{"$f":"Hauptbuch!J120","v":0}]
["7510","Zinsaufwendungen",{"$f":"Hauptbuch!J123","v":0}]
[{"$f":"IF(SUM($F$4:$F$13)>SUM($C$4:$C$13),\"3000\",\"\")","v":""},{"$f":"IF(SUM($F$4:$F$13)>SUM($C$4:$C$13),\"Eigenkapital\",\"\")","v":""},{"$f":"IF(SUM($F$4:$F$13)>SUM($C$4:$C$13),SUM($F$4:$F$13)-SUM($C$4:$C$13),0)","v":0},{"$f":"IF(SUM($F$4:$F$13)>SUM($C$4:$C$13),\"\",\"3000\")","v":"3000"},{"$f":"IF(SUM($F$4:$F$13)>SUM($C$4:$C$13),\"\",\"Eigenkapital\")","v":"Eigenkapital"},{"$f":"IF(SUM($F$4:$F$13)>SUM($C$4:$C$13),0,SUM($C$4:$C$13)-SUM(F4:F13))","v":83500}]
[null,null,{"$f":"IF(SUM($F$4:$F$13)>SUM($C$4:$C$13),SUM($F$4:$F$13),SUM($C$4:$C$13))","v":83500},null,null,{"$f":"IF(SUM($F$4:$F$13)>SUM($C$4:$C$13),SUM($F$4:$F$13),SUM($C$4:$C$13))","v":83500}]

{"sheet":"Bilanzbuch","index":4,"n_rows":31,"n_cols":6,"rows_kept":31,"cut":false,"hidden":false,"merged":[[2,1,2,4],[0,0,0,5],[17,1,17,4]]}
["Bilanzbuch"]
[]
["Aktiva","8000 Eröffnungsbilanz",null,null,null,"Passiva"]
["0500","Grundstücke und Bauten",330000,"3000","Eigenkapital",{"$f":"F16-SUM(F5:F15)","v":698100}]
["0700","Technische Anlagen und Maschinen",380500,"4200","Verbindlichkeiten g. Kreditinstituten",534000]
["0800","Betriebs- und Geschäftsausstattung",54900,"4400","Verbindlichkeiten a.L.u.L.",118900]
["0840","Fuhrpark",116000,"4800","Umsatzsteuer",11100]
["2000","Rohstoffe",200000]
["2020","Hilfsstoffe",22500]
["2040","Betriebsstoffe",6700]
["2100","Unfertige Erzeugnisse",64500]
["2200","Fertige Erzeugnisse",19000]
["2400","Forderungen a.L.u.L.",45600]
["2800","Bank",112600]
["2880","Kasse",9800]
[null,null,{"$f":"SUM(C4:C15)","v":1362100},null,null,{"$f":"C16","v":1362100}]
[]
["Aktiva","8010 Schlussbilanz",null,null,null,"Passiva"]
["0500","Grundstücke und Bauten",{"$f":"Hauptbuch!J4","v":330000},"3000","Eigenkapital",{"$f":"Hauptbuch!E67","v":614600}]
["0700","Technische Anlagen und Maschinen",{"$f":"Hauptbuch!J7","v":380500},"4200","Verbindlichkeiten g. Kreditinstituten",{"$f":"Hauptbuch!E71","v":534000}]
["0800","Betriebs- und Geschäftsausstattung",{"$f":"Hauptbuch!J11","v":54900},"4400","Verbindlichkeiten a.L.u.L.",{"$f":"Hauptbuch!E74","v":118900}]
["0840","Fuhrpark",{"$f":"Hauptbuch!J15","v":116000},"4800","Umsatzsteuer",{"$f":"Hauptbuch!E82","v":11100}]
["2000","Rohstoffe",{"$f":"Hauptbuch!J19","v":200000}]
["2020","Hilfsstoffe",{"$f":"Hauptbuch!J24","v":22500}]
["2040","Betriebsstoffe",{"$f":"Hauptbuch!J29","v":6700}]
["2100","Unfertige Erzeugnisse",{"$f":"Grundbuch!D97","v":0}]
["2200","Fertige Erzeugnisse",{"$f":"Grundbuch!D98","v":0}]
["2400","Forderungen a.L.u.L.",{"$f":"Hauptbuch!J44","v":45600}]
["2800","Bank",{"$f":"Hauptbuch!J56","v":112600}]
["2880","Kasse",{"$f":"Hauptbuch!J62","v":9800}]
[null,null,{"$f":"SUM(C19:C30)","v":1278600},null,null,{"$f":"SUM(F19:F30)","v":1278600}]

{"sheet":"Kontenplan","index":5,"n_rows":35,"n_cols":2,"rows_kept":35,"cut":false,"hidden":false,"merged":[]}
[null,"Kontenplan"]
[]
["Nr.","Konto"]
["0500","Grundstücke und Bauten"]
["0700","Technische Anlagen und Maschinen"]
["0800","Betriebs- und Geschäftsausstattung"]
["0840","Fuhrpark"]
["2000","Rohstoffe"]
["2020","Hilfsstoffe"]
["2030","Betriebsstoffe"]
["2040","Betriebsstoffe"]
["2100","Unfertige Erzeugnisse"]
["2200","Fertige Erzeugnisse"]
["2400","Forderungen a.L.u.L."]
["2600","Vorsteuer"]
["2800","Kreditinstitute/Bank"]
["2880","Kasse"]
["3000","Eigenkapital"]
["4200","Verbindlichkeiten g. Kreditinstituten"]
["4400","Verbindlichkeiten a.L.u.L."]
["4800","Umsatzsteuer"]
["5000","Umsatzerlöse"]
["5200","Bestandsveränderungen"]
["6000","Aufwendungen für Rohstoffe"]
["6020","Aufwendungen für Hilfsstoffe"]
["6030","Aufwendungen für Betriebsstoffe"]
["6160","Fremdinstandhaltung"]
["6200","Löhne"]
["6300","Gehälter"]
["6820","Portokosten"]
["7000","Betriebliche Steuern"]
["7510","Zinsaufwendungen"]
["8000","Eröffnungsbilanz"]
["8010","Schlussbilanz"]
["8020","Gewinn und Verlust"]