{"text_format":"1","workbook":"xlsx","n_sheets":6,"sheets":["Hinweise","Grundbuch","Hauptbuch","GuV","Bilanzbuch","Kontenplan"],"not_rendered":{"charts":0,"images":18,"macros":1,"external_links":0,"defined_names":0,"comments":0,"pivot_tables":0},"unopened":[],"bounds":{"document_bytes":16777216,"sheet_cells":100000,"rows_first":2000,"rows_last":500,"rows_between":2000,"halvings":0,"cell_chars":16384,"cell_head_chars":4096},"cells_cut":0,"cells_raw":0,"read":"whole","date_system":"1900"}

{"sheet":"Hinweise","index":0,"n_rows":26,"n_cols":1,"rows_kept":26,"cut":false,"hidden":false,"merged":[[0,0,0,7],[2,0,2,1]]}
["Geschäftsgang 3"]
[]
["Voraussetzungen"]
["Um den Geschäftsgang buchen zu können müssen Sie Kenntnisse über die folgenden Lehrninhalte haben:"]
["Buchungen auf Bestandskonten"]
["Buchungen auf Erfolgskonten"]
["Bestandsveränderungen"]
["Umsatzsteuer"]
[]
["Vorgehensweise"]
["1. Wählen Sie die Tabelle \"Grundbuch\"."]
[]
["2. Buchen Sie die Geschäftsvorfälle"]
["    entweder durch Direkteingabe in die entsprechenden Felder des Grundbuchs (Kontennummern und Beträge)"]
["    oder durch Aufruf von Buchungsfenstern. (Klicken Sie dazu jeweils auf die Schaltfläche \"Buchung\" und beenden"]
["    Sie die Eingabe  mit \"OK\".)"]
["    Die Kontennummern sind vierstellig anzugeben. (siehe Kontenplan). Bei zusammengesetzten Buchungssätzen"]
["    sind die Buchungen nach der Höhe der Beträge geordnet vorzunehmen. "]
[]
["3. Sie können sich den Kontenplan mit Kontennummern jederzeit durch Klick auf den"]
["    entsprechenden Button anzeigen lassen."]
[]
["4. Die Richtigkeit Ihrer Buchungen wird bestätigt oder Sie werden auf"]
["    Fehler hingewiesen. (Ohne Buchung werden Fehler angezeigt.)"]
[]
["5. Hauptbuch, Gewinn und Verlust und Bilanzbuch werden automatisch erstellt. "]

{"sheet":"Grundbuch","index":1,"n_rows":107,"n_cols":11,"rows_kept":107,"cut":false,"hidden":false,"merged":[[7,5,7,6],[9,0,10,0],[12,1,14,2],[12,5,12,6],[13,5,13,6],[14,5,14,6],[16,0,17,0],[19,5,19,6],[106,0,106,6],[1,0,1,4],[2,0,2,4],[5,1,7,2],[5,5,5,6],[6,5,6,6],[27,5,27,6],[28,5,28,6],[30,0,31,0],[35,5,35,6],[20,5,20,6],[21,5,21,6],[23,0,24,0],[26,5,26,6],[53,0,54,0],[36,5,36,6],[98,0,98,2],[38,0,40,0],[33,5,34,6],[42,1,44,2],[42,5,42,6],[43,5,43,6],[44,5,44,6],[46,0,47,0],[56,1,58,2],[56,5,56,6],[57,5,57,6],[58,5,58,6],[49,5,49,6],[50,5,50,6],[51,5,51,6],[49,1,51,2],[64,5,64,6],[65,5,65,6],[60,0,61,0],[60,1,61,1],[60,2,61,2],[60,3,61,3],[60,4,61,4],[60,5,61,5],[60,6,61,6],[63,5,63,6],[67,4,68,4],[67,5,68,5],[67,6,68,6],[70,5,70,6],[67,0,68,0],[67,1,68,1],[67,2,68,2],[67,3,68,3],[74,0,75,0],[74,1,75,1],[74,2,75,2],[74,3,75,3],[74,4,75,4],[74,5,75,5],[77,1,79,2],[77,5,77,6],[78,5,78,6],[79,5,79,6],[71,5,71,6],[72,5,72,6],[74,6,75,6],[95,3,96,3],[91,5,91,6],[92,5,92,6],[93,5,93,6],[81,0,82,0],[84,5,84,6],[85,5,85,6],[86,5,86,6],[88,0,89,0],[100,5,100,6],[101,5,101,6],[103,0,104,0],[99,5,99,6],[95,4,96,4],[95,5,96,5],[95,6,96,6],[95,0,96,0],[95,1,96,1],[95,2,96,2]]}
[]
["Geschäftsvorfälle"]
["Grundbuch"]
[null,null,null,null,null,null,0.19]
[]
["1.","Zieleinkauf von Hilfsstoffen, ",null,"netto",7300,{"$f":"IF(AND(B10=\"2020\",B11=\"2600\",E10=\"4400\"),\"Die Konten sind richtig!\",\"Mindestens ein Konto ist falsch!\")","v":"Mindestens ein Konto ist falsch!"}]
["Geschäftsvorfall",null,null,"USt.",{"$f":"E6*G4","v":1387},{"$f":"IF(AND(D10=E6,D11=E7,G10=E8),\"Die Beträge sind richtig!\",\"Mindestens ein Betrag ist falsch!\")","v":"Mindestens ein Betrag ist falsch!"}]
[null,null,null,"brutto",{"$f":"SUM(E6:E7)","v":8687},{"$f":"IF(AND(F6=\"Die Konten sind richtig!\",F7=\"Die Beträge sind richtig!\"),\"Alles richtig!\",\"Es sind noch Fehler vorhanden!\")","v":"Es sind noch Fehler vorhanden!"}]
[null,"Soll","Konto","€","Haben","Konto","€"]
["Buchungssatz","",{"$f":"IF(B10=\"\",\"\",VLOOKUP(B10,Kontenplan!$A$4:$B$33,2))","v":""},null,"",{"$f":"IF(E10=\"\",\"\",VLOOKUP(E10,Kontenplan!$A$4:$B$33,2))","v":""}]
[null,"",{"$f":"IF(B11=\"\",\"\",VLOOKUP(B11,Kontenplan!$A$4:$B$33,2))","v":""}]
[]
["2.","Barverkauf von fertigen Erzeugnissen,",null,"netto",1500,{"$f":"IF(AND(B17=\"2880\",E17=\"5000\",E18=\"4800\"),\"Die Konten sind richtig!\",\"Mindestens ein Konto ist falsch!\")","v":"Mindestens ein Konto ist falsch!"}]
["Geschäftsvorfall",null,null,"USt.",{"$f":"E13*G4","v":285},{"$f":"IF(AND(D17=E15,G17=E13,G18=E14),\"Die Beträge sind richtig!\",\"Mindestens ein Betrag ist falsch!\")","v":"Mindestens ein Betrag ist falsch!"}]
[null,null,null,"brutto",{"$f":"SUM(E13:E14)","v":1785},{"$f":"IF(AND(F13=\"Die Konten sind richtig!\",F14=\"Die Beträge sind richtig!\"),\"Alles richtig!\",\"Es sind noch Fehler vorhanden!\")","v":"Es sind noch Fehler vorhanden!"}]
[null,"Soll","Konto","€","Haben","Konto","€"]
["Buchungssatz","",{"$f":"IF(B17=\"\",\"\",VLOOKUP(B17,Kontenplan!$A$4:$B$33,2))","v":""},null,"",{"$f":"IF(E17=\"\",\"\",VLOOKUP(E17,Kontenplan!$A$4:$B$33,2))","v":""}]
[null,null,null,null,"",{"$f":"IF(E18=\"\",\"\",VLOOKUP(E18,Kontenplan!$A$4:$B$33,2))","v":""}]
[null," "]
["3.","Banküberweisung für - Löhne",null,null,7900,{"$f":"IF(AND(B24=\"6200\",B25=\"6300\",E24=\"2800\"),\"Die Konten sind richtig!\",\"Mindestens ein Konto ist falsch!\")","v":"Mindestens ein Konto ist falsch!"}]
["Geschäftsvorfall",null,"           - Gehälter",null,4000,{"$f":"IF(AND(D24=E20,D25=E21,G24=E22),\"Die Beträge sind richtig!\",\"Mindestens ein Betrag ist falsch!\")","v":"Mindestens ein Betrag ist falsch!"}]
[null,null,"             Banklastschrift",null,{"$f":"SUM(E20:E21)","v":11900},{"$f":"IF(AND(F20=\"Die Konten sind richtig!\",F21=\"Die Beträge sind richtig!\"),\"Alles richtig!\",\"Es sind noch Fehler vorhanden!\")","v":"Es sind noch Fehler vorhanden!"}]
[null,"Soll","Konto","€","Haben","Konto","€"]
["Buchungssatz","",{"$f":"IF(B24=\"\",\"\",VLOOKUP(B24,Kontenplan!$A$4:$B$33,2))","v":""},null,"",{"$f":"IF(E24=\"\",\"\",VLOOKUP(E24,Kontenplan!$A$4:$B$33,2))","v":""}]
[null,"",{"$f":"IF(B25=\"\",\"\",VLOOKUP(B25,Kontenplan!$A$4:$B$33,2))","v":""}]
[]
["4.","Verkauf von fertigen Erzeugnissen",null,"netto",16000,{"$f":"IF(AND(B31=\"2800\",E31=\"5000\",E32=\"4800\"),\"Die Konten sind richtig!\",\"Mindestens ein Konto ist falsch!\")","v":"Mindestens ein Konto ist falsch!"}]
["Geschäftsvorfall","gegen Bankscheck,",null,"USt.",{"$f":"E27*G4","v":3040},{"$f":"IF(AND(D31=E29,G31=E27,G32=E28),\"Die Beträge sind richtig!\",\"Mindestens ein Betrag ist falsch!\")","v":"Mindestens ein Betrag ist falsch!"}]
[null,null,null,"brutto",{"$f":"SUM(E27:E28)","v":19040},{"$f":"IF(AND(F27=\"Die Konten sind richtig!\",F28=\"Die Beträge sind richtig!\"),\"Alles richtig!\",\"Es sind noch Fehler vorhanden!\")","v":"Es sind noch Fehler vorhanden!"}]
[null,"Soll","Konto","€","Haben","Konto","€"]
["Buchungssatz","",{"$f":"IF(B31=\"\",\"\",VLOOKUP(B31,Kontenplan!$A$4:$B$33,2))","v":""},null,"",{"$f":"IF(E31=\"\",\"\",VLOOKUP(E31,Kontenplan!$A$4:$B$33,2))","v":""}]
[null,null,null,null,"",{"$f":"IF(E32=\"\",\"\",VLOOKUP(E32,Kontenplan!$A$4:$B$33,2))","v":""}]
[]
["5.","Stoffverbrauch lt. Materialentnahmescheine für",null,null,null,{"$f":"IF(AND(B39=\"6000\",E39=\"2000\",B40=\"6020\",E40=\"2020\",B41=\"6030\",E41=\"2030\"),\"Die Konten sind richtig!\",\"Mindestens ein Konto ist falsch!\")","v":"Mindestens ein Konto ist falsch!"}]
["Geschäftsvorfall",null,"           - Rohstoffe",null,3900]
[null,null,"           - Hilfsstoffe",null,5100,{"$f":"IF(AND(D39=E35,D40=E36,D41=E37,G39=E35,G40=E36,G41=E37),\"Die Beträge sind richtig!\",\"Mindestens ein Betrag ist falsch!\")","v":"Mindestens ein Betrag ist falsch!"}]
[null,null,"           - Betriebsstoffe",null,950,{"$f":"IF(AND(F34=\"Die Konten sind richtig!\",F36=\"Die Beträge sind richtig!\"),\"Alles richtig!\",\"Es sind noch Fehler vorhanden!\")","v":"Es sind noch Fehler vorhanden!"}]
[null,"Soll","Konto","€","Haben","Konto","€"]
["Buchungssatz","",{"$f":"IF(B39=\"\",\"\",VLOOKUP(B39,Kontenplan!$A$4:$B$33,2))","v":""},null,"",{"$f":"IF(E39=\"\",\"\",VLOOKUP(E39,Kontenplan!$A$4:$B$33,2))","v":""}]
[null,"",{"$f":"IF(B40=\"\",\"\",VLOOKUP(B40,Kontenplan!$A$4:$B$33,2))","v":""},null,"",{"$f":"IF(E40=\"\",\"\",VLOOKUP(E40,Kontenplan!$A$4:$B$33,2))","v":""}]
[null,"",{"$f":"IF(B41=\"\",\"\",VLOOKUP(B41,Kontenplan!$A$4:$B$33,2))","v":""},null,"",{"$f":"IF(E41=\"\",\"\",VLOOKUP(E41,Kontenplan!$A$4:$B$33,2))","v":""}]
[]
["6.","Verkauf von fertigen Erzeugnissen auf Ziel,",null,"netto",44000,{"$f":"IF(AND(B47=\"2400\",E47=\"5000\",E48=\"4800\"),\"Die Konten sind richtig!\",\"Mindestens ein Konto ist falsch!\")","v":"Mindestens ein Konto ist falsch!"}]
["Geschäftsvorfall",null,null,"USt.",{"$f":"E43*G4","v":8360},{"$f":"IF(AND(D47=E45,G47=E43,G48=E44),\"Die Beträge sind richtig!\",\"Mindestens ein Betrag ist falsch!\")","v":"Mindestens ein Betrag ist falsch!"}]
[null,null,null,"brutto",{"$f":"SUM(E43:E44)","v":52360},{"$f":"IF(AND(F43=\"Die Konten sind richtig!\",F44=\"Die Beträge sind richtig!\"),\"Alles richtig!\",\"Es sind noch Fehler vorhanden!\")","v":"Es sind noch Fehler vorhanden!"}]
[null,"Soll","Konto","€","Haben","Konto","€"]
["Buchungssatz","",{"$f":"IF(B47=\"\",\"\",VLOOKUP(B47,Kontenplan!$A$4:$B$33,2))","v":""},null,"",{"$f":"IF(E47=\"\",\"\",VLOOKUP(E47,Kontenplan!$A$4:$B$33,2))","v":""}]
[null,null,null,null,"",{"$f":"IF(E48=\"\",\"\",VLOOKUP(E48,Kontenplan!$A$4:$B$33,2))","v":""}]
[]
["7.","Barzahlung für Werbeinserat in der Presse,",null,"netto",500,{"$f":"IF(AND(B54=\"6870\",B55=\"2600\",E54=\"2880\"),\"Die Konten sind richtig!\",\"Mindestens ein Konto ist falsch!\")","v":"Mindestens ein Konto ist falsch!"},null,null,null,null,{"$f":"IF(J50=\"\",\"\",VLOOKUP(J50,Kontenplan!$A$4:$B$33,2))","v":""}]
["Geschäftsvorfall",null,null,"USt.",{"$f":"E50*G4","v":95},{"$f":"IF(AND(D54=E50,D55=E51,G54=E52),\"Die Beträge sind richtig!\",\"Mindestens ein Betrag ist falsch!\")","v":"Mindestens ein Betrag ist falsch!"}]
[null,null,null,"brutto",{"$f":"SUM(E50:E51)","v":595},{"$f":"IF(AND(F50=\"Die Konten sind richtig!\",F51=\"Die Beträge sind richtig!\"),\"Alles richtig!\",\"Es sind noch Fehler vorhanden!\")","v":"Es sind noch Fehler vorhanden!"}]
[null,"Soll","Konto","€","Haben","Konto","€"]
["Buchungssatz","",{"$f":"IF(B54=\"\",\"\",VLOOKUP(B54,Kontenplan!$A$4:$B$33,2))","v":""},null,"",{"$f":"IF(E54=\"\",\"\",VLOOKUP(E54,Kontenplan!$A$4:$B$33,2))","v":""}]
[null,"",{"$f":"IF(B55=\"\",\"\",VLOOKUP(B55,Kontenplan!$A$4:$B$33,2))","v":""}]
[]
["8.","Zinsgutschrift der Bank,",null,null,140,{"$f":"IF(AND(B61=\"2800\",E61=\"5710\"),\"Die Konten sind richtig!\",\"Mindestens ein Konto ist falsch!\")","v":"Mindestens ein Konto ist falsch!"}]
["Geschäftsvorfall",null,null,null,null,{"$f":"IF(AND(D61=E57,G61=E57),\"Die Beträge sind richtig!\",\"Mindestens ein Betrag ist falsch!\")","v":"Mindestens ein Betrag ist falsch!"}]
[null,null,null,null,null,{"$f":"IF(AND(F57=\"Die Konten sind richtig!\",F58=\"Die Beträge sind richtig!\"),\"Alles richtig!\",\"Es sind noch Fehler vorhanden!\")","v":"Es sind noch Fehler vorhanden!"}]
[null,"Soll","Konto","€","Haben","Konto","€"]
["Buchungssatz","",{"$f":"IF(B61=\"\",\"\",VLOOKUP(B61,Kontenplan!$A$4:$B$33,2))","v":""},null,"",{"$f":"IF(E61=\"\",\"\",VLOOKUP(E61,Kontenplan!$A$4:$B$33,2))","v":""}]
[]
[]
["9.","Unser Mieter überweist ",null,null,null,{"$f":"IF(AND(B68=\"2800\",E68=\"5400\"),\"Die Konten sind richtig!\",\"Mindestens ein Konto ist falsch!\")","v":"Mindestens ein Konto ist falsch!"}]
["Geschäftsvorfall","für den laufenden Monat,",null,null,850,{"$f":"IF(AND(D68=E65,G68=E65),\"Die Beträge sind richtig!\",\"Mindestens ein Betrag ist falsch!\")","v":"Mindestens ein Betrag ist falsch!"}]
[null,null,null,null,null,{"$f":"IF(AND(F64=\"Die Konten sind richtig!\",F65=\"Die Beträge sind richtig!\"),\"Alles richtig!\",\"Es sind noch Fehler vorhanden!\")","v":"Es sind noch Fehler vorhanden!"}]
[null,"Soll","Konto","€","Haben","Konto","€"]
["Buchungssatz","",{"$f":"IF(B68=\"\",\"\",VLOOKUP(B68,Kontenplan!$A$4:$B$33,2))","v":""},null,"",{"$f":"IF(E68=\"\",\"\",VLOOKUP(E68,Kontenplan!$A$4:$B$33,2))","v":""}]
[]
[]
["10.","Überweisung an das Finanzamt für KFZ-Steuer,",null,null,720,{"$f":"IF(AND(B75=\"7030\",E75=\"2800\"),\"Die Konten sind richtig!\",\"Mindestens ein Konto ist falsch!\")","v":"Mindestens ein Konto ist falsch!"}]
["Geschäftsvorfall",null,null,null,null,{"$f":"IF(AND(D75=E71,G75=E71),\"Die Beträge sind richtig!\",\"Mindestens ein Betrag ist falsch!\")","v":"Mindestens ein Betrag ist falsch!"}]
[null,null,null,null,null,{"$f":"IF(AND(F71=\"Die Konten sind richtig!\",F72=\"Die Beträge sind richtig!\"),\"Alles richtig!\",\"Es sind noch Fehler vorhanden!\")","v":"Es sind noch Fehler vorhanden!"}]
[null,"Soll","Konto","€","Haben","Konto","€"]
["Buchungssatz","",{"$f":"IF(B75=\"\",\"\",VLOOKUP(B75,Kontenplan!$A$4:$B$33,2))","v":""},null,"",{"$f":"IF(E75=\"\",\"\",VLOOKUP(E75,Kontenplan!$A$4:$B$33,2))","v":""}]
[]
[]
["11.","Zieleinkauf von Rohstoffen, ",null,"netto",5200,{"$f":"IF(AND(B82=\"2000\",B83=\"2600\",E82=\"4400\"),\"Die Konten sind richtig!\",\"Mindestens ein Konto ist falsch!\")","v":"Mindestens ein Konto ist falsch!"}]
["Geschäftsvorfall",null,null,"USt.",{"$f":"E78*G4","v":988},{"$f":"IF(AND(D82=E78,D83=E79,G82=E80),\"Die Beträge sind richtig!\",\"Mindestens ein Betrag ist falsch!\")","v":"Mindestens ein Betrag ist falsch!"}]
[null,null,null,"brutto",{"$f":"SUM(E78:E79)","v":6188},{"$f":"IF(AND(F78=\"Die Konten sind richtig!\",F79=\"Die Beträge sind richtig!\"),\"Alles richtig!\",\"Es sind noch Fehler vorhanden!\")","v":"Es sind noch Fehler vorhanden!"}]
{"$rows_left_out":28}
{"sheet":"Hauptbuch","index":2,"n_rows":119,"n_cols":10,"rows_kept":119,"cut":false,"hidden":false,"merged":[[117,1,117,8],[108,1,108,8],[111,1,111,8],[114,1,114,8],[11,1,11,8],[16,1,16,8],[21,1,21,8],[26,1,26,8],[0,0,0,9],[2,1,2,8],[5,1,5,8],[8,1,8,8],[55,1,55,8],[61,1,61,8],[66,1,66,8],[72,1,72,8],[31,1,31,8],[36,1,36,8],[41,1,41,8],[48,1,48,8],[96,1,96,8],[105,1,105,8],[99,1,99,8],[102,1,102,8],[78,1,78,8],[84,1,84,8],[90,1,90,8],[93,1,93,8]]}
["Hauptbuch"]
[]
["Soll","0510 Bebaute Grundstücke",null,null,null,null,null,null,null,"Haben"]
["AB","8000",null,null,{"$f":"Bilanzbuch!C4","v":210000},"SB",8010,null,null,{"$f":"E4","v":210000}]
[]
["Soll","0700 Technische Anlagen und Maschinen",null,null,null,null,null,null,null,"Haben"]
["AB","8000",null,null,{"$f":"Bilanzbuch!C5","v":95000},"SB",8010,null,null,{"$f":"E7","v":95000}]
[]
["Soll","0800 Betriebs- und Geschäftsausstattung",null,null,null,null,null,null,null,"Haben"]
["AB","8000",null,null,{"$f":"Bilanzbuch!C6","v":41000},"SB",8010,null,null,{"$f":"E10","v":41000}]
[]
["Soll","2000 Rohstoffe",null,null,null,null,null,null,null,"Haben"]
["AB","8000",null,null,{"$f":"Bilanzbuch!C7","v":12000},"5.",{"$f":"Grundbuch!B39","v":""},null,null,{"$f":"Grundbuch!G39","v":0}]
["11.",{"$f":"Grundbuch!E82","v":""},null,null,{"$f":"Grundbuch!D82","v":0},"SB",8010,null,null,{"$f":"J15-J13","v":12000}]
[null,null,null,null,{"$f":"SUM(E13:E14)","v":12000},null,null,null,null,{"$f":"E15","v":12000}]
[]
["Soll","2020 Hilfsstoffe",null,null,null,null,null,null,null,"Haben"]
["AB","8000",null,null,{"$f":"Bilanzbuch!C8","v":10500},"5.",{"$f":"Grundbuch!B40","v":""},null,null,{"$f":"Grundbuch!G40","v":0}]
["1.",{"$f":"Grundbuch!E10","v":""},null,null,{"$f":"Grundbuch!D10","v":0},"SB",8010,null,null,{"$f":"J20-J18","v":10500}]
[null,null,null,null,{"$f":"SUM(E18:E19)","v":10500},null,null,null,null,{"$f":"E20","v":10500}]
[]
["Soll","2030 Betriebsstoffe",null,null,null,null,null,null,null,"Haben"]
["AB","8000",null,null,{"$f":"Bilanzbuch!C9","v":9300},"5.",{"$f":"Grundbuch!B41","v":""},null,null,{"$f":"Grundbuch!G41","v":0}]
[null,null,null,null,null,"SB",8010,null,null,{"$f":"J25-J23","v":9300}]
[null,null,null,null,{"$f":"SUM(E23:E24)","v":9300},null,null,null,null,{"$f":"E25","v":9300}]
[]
["Soll","2100 Unfertige Erzeugnisse",null,null,null,null,null,null,null,"Haben"]
["AB","8000",null,null,{"$f":"Bilanzbuch!C10","v":17600},"SB",{"$f":"Grundbuch!B104","v":""},null,null,{"$f":"Grundbuch!G104","v":0}]
[{"$f":"IF(E28<J28,\"A\",\"\")","v":""},{"$f":"IF(E28<J28,5200,\"\")","v":""},null,null,{"$f":"IF(E28<J28,E30-E28,\"\")","v":""},{"$f":"IF(E28>J28,\"A\",\"\")","v":"A"},{"$f":"IF(J28<E28,5200,\"\")","v":5200},null,null,{"$f":"IF($E$28>$J$28,J30-J28,\"\")","v":17600}]
[null,null,null,null,{"$f":"IF($E$28>$J$28,$E$28,$J$28)","v":17600},null,null,null,null,{"$f":"IF($E$28>$J$28,$E$28,$J$28)","v":17600}]
[]
["Soll","2200 Fertige Erzeugnisse",null,null,null,null,null,null,null,"Haben"]
["AB","8000",null,null,{"$f":"Bilanzbuch!C11","v":12900},"SB",{"$f":"Grundbuch!B105","v":""},null,null,{"$f":"Grundbuch!G105","v":0}]
[{"$f":"IF(E33<J33,\"A\",\"\")","v":""},{"$f":"IF(E33<J33,5200,\"\")","v":""},null,null,{"$f":"IF(E33<E35,E35-E33,\"\")","v":""},{"$f":"IF(J33<E33,\"A\",\"\")","v":"A"},{"$f":"IF(J33<E33,5200,\"\")","v":5200},null,null,{"$f":"IF(J33<E33,J35-J33,\"\")","v":12900}]
[null,null,null,null,{"$f":"IF(E33>J33,E33,J33)","v":12900},null,null,null,null,{"$f":"IF(E33>J33,E33,J33)","v":12900}]
[]
["Soll","2400 Forderungen aus Lieferungen und Leistungen",null,null,null,null,null,null,null,"Haben"]
["AB","8000",null,null,{"$f":"Bilanzbuch!C12","v":22800},"SB",8010,null,null,{"$f":"J40","v":22800}]
["6.",{"$f":"Grundbuch!E47","v":""},{"$f":"Grundbuch!E48","v":""},null,{"$f":"Grundbuch!D47","v":0}]
[null,null,null,null,{"$f":"SUM(E38:E39)","v":22800},null,null,null,null,{"$f":"E40","v":22800}]
[]
["Soll","2600 Vorsteuer",null,null,null,null,null,null,null,"Haben"]
["1.",{"$f":"Grundbuch!E10","v":""},null,null,{"$f":"Grundbuch!D11","v":0},"SB",4800,null,null,{"$f":"J47","v":0}]
["7.",{"$f":"Grundbuch!E54","v":""},null,null,{"$f":"Grundbuch!D55","v":0}]
["11.",{"$f":"Grundbuch!E82","v":""},null,null,{"$f":"Grundbuch!D83","v":0}]
["12.",{"$f":"Grundbuch!E89","v":""},null,null,{"$f":"Grundbuch!D90","v":0}]
[null,null,null,null,{"$f":"SUM(E43:E46)","v":0},null,null,null,null,{"$f":"E47","v":0}]
[]
["Soll","2800 Kreditinstitute/Bank",null,null,null,null,null,null,null,"Haben"]
["AB","8000",null,null,{"$f":"Bilanzbuch!C13","v":13000},"3.",{"$f":"Grundbuch!B24","v":""},{"$f":"Grundbuch!B25","v":""},null,{"$f":"Grundbuch!G24","v":0}]
["4.",{"$f":"Grundbuch!E31","v":""},{"$f":"Grundbuch!E32","v":""},null,{"$f":"Grundbuch!D31","v":0},"10.",{"$f":"Grundbuch!B75","v":""},null,null,{"$f":"Grundbuch!G75","v":0}]
["8.",{"$f":"Grundbuch!E61","v":""},null,null,{"$f":"Grundbuch!D61","v":0},"13.",{"$f":"Grundbuch!B96","v":""},null,null,{"$f":"Grundbuch!G96","v":0}]
["9.",{"$f":"Grundbuch!E68","v":""},null,null,{"$f":"Grundbuch!D68","v":0},"SB",8010,null,null,{"$f":"J54-SUM(J50:J52)","v":13000}]
[null,null,null,null,{"$f":"SUM(E50:E53)","v":13000},null,null,null,null,{"$f":"E54","v":13000}]
[]
["Soll","2880 Kasse",null,null,null,null,null,null,null,"Haben"]
["AB","8000",null,null,{"$f":"Bilanzbuch!C14","v":6750},"7.",{"$f":"Grundbuch!B54","v":""},{"$f":"Grundbuch!B55","v":""},null,{"$f":"Grundbuch!G54","v":0}]
["2.",{"$f":"Grundbuch!E17","v":""},{"$f":"Grundbuch!E18","v":""},null,{"$f":"Grundbuch!D17","v":0},"12.",{"$f":"Grundbuch!B89","v":""},{"$f":"Grundbuch!B90","v":""},null,{"$f":"Grundbuch!G89","v":0}]
[null,null,null,null,null,"SB",8010,null,null,{"$f":"J60-SUM(J57:J58)","v":6750}]
[null,null,null,null,{"$f":"SUM(E57:E59)","v":6750},null,null,null,null,{"$f":"E60","v":6750}]
[]
["Soll","3000 Eigenkapital",null,null,null,null,null,null,null,"Haben"]
["A",8020,null,null,{"$f":"IF(GuV!F8>0,GuV!F8,0)","v":30500},"AB",8000,null,null,{"$f":"Bilanzbuch!F4","v":400000}]
["SB",8010,null,null,{"$f":"E65-E63","v":369500},"A",8020,null,null,{"$f":"IF(GuV!C13>0,GuV!C13,0)","v":0}]
[null,null,null,null,{"$f":"J65","v":400000},null,null,null,null,{"$f":"SUM(J63:J64)","v":400000}]
[]
["Soll","4400 Verbindlichkeiten aus Lieferungen und Leistungen",null,null,null,null,null,null,null,"Haben"]
["13.",{"$f":"Grundbuch!E96","v":""},null,null,{"$f":"Grundbuch!D96","v":0},"AB",8000,null,null,{"$f":"Bilanzbuch!F5","v":50850}]
["SB",8010,null,null,{"$f":"E71-E68","v":50850},"1.",{"$f":"Grundbuch!B10","v":""},{"$f":"Grundbuch!B11","v":""},null,{"$f":"Grundbuch!G10","v":0}]
[null,null,null,null,null,"11.",{"$f":"Grundbuch!B82","v":""},{"$f":"Grundbuch!B83","v":""},null,{"$f":"Grundbuch!G82","v":0}]
[null,null,null,null,{"$f":"J71","v":50850},null,null,null,null,{"$f":"SUM(J68:J70)","v":50850}]
[]
["Soll","4800 Umsatzsteuer",null,null,null,null,null,null,null,"Haben"]
["A",2600,null,null,{"$f":"J43","v":0},"2.",{"$f":"Grundbuch!B17","v":""},null,null,{"$f":"Grundbuch!G18","v":0}]
["SB",8010,null,null,{"$f":"E77-E74","v":0},"4.",{"$f":"Grundbuch!B31","v":""},null,null,{"$f":"Grundbuch!G32","v":0}]
[null,null,null,null,null,"6.",{"$f":"Grundbuch!B47","v":""},null,null,{"$f":"Grundbuch!G48","v":0}]
[null,null,null,null,{"$f":"J77","v":0},null,null,null,null,{"$f":"SUM(J74:J76)","v":0}]
[]
["Soll","5000 Umsatzerlöse",null,null,null,null,null,null,null,"Haben"]
["A",8020,null,null,{"$f":"E83","v":0},"2.",{"$f":"Grundbuch!B17","v":""},null,null,{"$f":"Grundbuch!G17","v":0}]
{"$rows_left_out":40}
{"sheet":"GuV","index":3,"n_rows":14,"n_cols":6,"rows_kept":14,"cut":false,"hidden":false,"merged":[[0,0,0,5],[2,1,2,4]]}
["Gewinn- und Verlustrechnung"]
[]
["Soll","8020 Gewinn und Verlust",null,null,null,"Haben"]
["5200","Bestandsveränderungen",{"$f":"IF(Hauptbuch!J88>0,Hauptbuch!J88,0)","v":30500},"5000","Umsatzerlöse",{"$f":"Hauptbuch!E80","v":0}]
["6000","Aufwendungen für Rohstoffe",{"$f":"Hauptbuch!J98","v":0},5200,"Bestandsveränderungen",{"$f":"IF(Hauptbuch!E88>0,Hauptbuch!E88,0)","v":0}]
["6020","Aufwendungen für Hilfsstoffe",{"$f":"Hauptbuch!E101","v":0},"5400","Mieterträge",{"$f":"Hauptbuch!E92","v":0}]
["6030","Aufwendungen für Betriebsstoffe",{"$f":"Hauptbuch!J104","v":0},"5710","Zinserträge",{"$f":"Hauptbuch!E95","v":0}]
["6160","Fremdinstandhaltung",{"$f":"Hauptbuch!J107","v":0},"3000","Eigenkapital",{"$f":"IF(SUM($F$4:$F$7)>SUM($C$4:$C$12),0,SUM($C$4:$C$12)-SUM(F4:F7))","v":30500}]
["6200","Löhne",{"$f":"Hauptbuch!J110","v":0}]
["6300","Gehälter",{"$f":"Hauptbuch!J113","v":0}]
["6870","Werbung",{"$f":"Hauptbuch!J116","v":0}]
["7030","Kraftfahrzeugsteuer",{"$f":"Hauptbuch!J119","v":0}]
["3000","Eigenkapital",{"$f":"IF(SUM($F$4:$F$7)>SUM($C$4:$C$12),SUM($F$4:$F$7)-SUM($C$4:$C$12),0)","v":0}]
[null,null,{"$f":"IF(SUM($F$4:$F$7)>SUM($C$4:$C$12),SUM($F$4:$F$7),SUM($C$4:$C$12))","v":30500},null,null,{"$f":"IF(SUM($F$4:$F$7)>SUM($C$4:$C$12),SUM($F$4:$F$7),SUM($C$4:$C$12))","v":30500}]

{"sheet":"Bilanzbuch","index":4,"n_rows":29,"n_cols":6,"rows_kept":29,"cut":false,"hidden":false,"merged":[[2,1,2,4],[0,0,0,5],[16,1,16,4]]}
["Bilanzbuch"]
[]
["Aktiva","8000 Eröffnungsbilanz",null,null,null,"Passiva"]
["0510","Bebaute Grundstücke",210000,"3000","Eigenkapital",{"$f":"F15-SUM(F5:F14)","v":400000}]
["0700","Technische Anlagen und Maschinen",95000,"4400","Verbindlichkeiten a.L.u.L.",50850]
["0800","Betriebs- und Geschäftsausstattung",41000]
["2000","Rohstoffe",12000]
["2020","Hilfsstoffe",10500]
["2040","Betriebsstoffe",9300]
["2100","Unfertige Erzeugnisse",17600]
["2200","Fertige Erzeugnisse",12900]
["2400","Forderungen a.L.u.L.",22800]
["2800","Bank",13000]
["2880","Kasse",6750]
[null,null,{"$f":"SUM(C4:C14)","v":450850},null,null,{"$f":"C15","v":450850}]
[]
["Aktiva","8010 Schlussbilanz",null,null,null,"Passiva"]
["0510","Bebaute Grundstücke",{"$f":"Hauptbuch!J4","v":210000},"3000","Eigenkapital",{"$f":"Hauptbuch!E64","v":369500}]
["0700","Technische Anlagen und Maschinen",{"$f":"Hauptbuch!J7","v":95000},"4400","Verbindlichkeiten a.L.u.L.",{"$f":"Hauptbuch!E69","v":50850}]
["0800","Betriebs- und Geschäftsausstattung",{"$f":"Hauptbuch!J10","v":41000},"4800","Umsatzsteuer",{"$f":"Hauptbuch!E75","v":0}]
["2000","Rohstoffe",{"$f":"Hauptbuch!J14","v":12000}]
["2020","Hilfsstoffe",{"$f":"Hauptbuch!J19","v":10500}]
["2040","Betriebsstoffe",{"$f":"Hauptbuch!J24","v":9300}]
["2100","Unfertige Erzeugnisse",{"$f":"Grundbuch!D104","v":0}]
["2200","Fertige Erzeugnisse",{"$f":"Grundbuch!D105","v":0}]
["2400","Forderungen a.L.u.L.",{"$f":"Hauptbuch!J38","v":22800}]
["2800","Bank",{"$f":"Hauptbuch!J53","v":13000}]
["2880","Kasse",{"$f":"Hauptbuch!J59","v":6750}]
[null,null,{"$f":"SUM(C18:C28)","v":420350},null,null,{"$f":"SUM(F18:F28)","v":420350}]

{"sheet":"Kontenplan","index":5,"n_rows":33,"n_cols":2,"rows_kept":33,"cut":false,"hidden":false,"merged":[]}
[null,"Kontenplan"]
[]
["Nr.","Konto"]
["0510","Bebaute Grundstücke"]
["0700","Technische Anlagen und Maschinen"]
["0800","Beriebs- und Geschäftsausstattung"]
["2000","Rohstoffe"]
["2020","Hilfsstoffe"]
["2030","Betriebsstoffe"]
["2100","Unfertige Erzeugnisse"]
["2200","Fertige Erzeugnisse"]
["2400","Forderungen a.L.u.L."]
["2600","Vorsteuer"]
["2800","Kreditinstitute/Bank"]
["2880","Kasse"]
["3000","Eigenkapital"]
["4400","Verbindlichkeiten a.L.u.L."]
["4800","Umsatzsteuer"]
["5000","Umsatzerlöse"]
["5200","Bestandsveränderungen"]
["5400","Mieterträge"]
["5710","Zinserträge"]
["6000","Aufwendungen für Rohstoffe"]
["6020","Aufwendungen für Hilfsstoffe"]
["6030","Aufwendungen für Betriebsstoffe"]
["6160","Fremdinstandhaltung"]
["6200","Löhne"]
["6300","Gehälter"]
["6870","Werbung"]
["7030","Kraftfahrzeugsteuer"]
["8000","Eröffnungsbilanz"]
["8010","Schlussbilanz"]
["8020","Gewinn und Verlust"]