{"text_format":"1","workbook":"xlsx","n_sheets":6,"sheets":["Hinweise","Grundbuch","Hauptbuch","GuV","Bilanzbuch","Kontenplan"],"not_rendered":{"charts":0,"images":19,"macros":1,"external_links":0,"defined_names":0,"comments":0,"pivot_tables":0},"unopened":[],"bounds":{"document_bytes":16777216,"sheet_cells":100000,"rows_first":2000,"rows_last":500,"rows_between":2000,"halvings":0,"cell_chars":16384,"cell_head_chars":4096},"cells_cut":0,"cells_raw":0,"read":"whole","date_system":"1900"}

{"sheet":"Hinweise","index":0,"n_rows":25,"n_cols":1,"rows_kept":25,"cut":false,"hidden":false,"merged":[[0,0,0,7],[2,0,2,1],[4,0,6,2]]}
["Geschäftsgang 2"]
[]
["Voraussetzungen"]
["Um den Geschäftsgang buchen zu können, müssen Sie Kenntnisse über die folgenden Lehrninhalte haben:"]
["Buchungen auf Bestandskonten Buchungen auf Erfolgskonten"]
[]
[]
[]
["Vorgehensweise"]
["1. Wählen Sie die Tabelle \"Grundbuch\"."]
[]
["2. Buchen Sie die Geschäftsvorfälle"]
["    entweder durch Direkteingabe in die entsprechenden Felder des Grundbuchs (Kontennummern und Beträge)"]
["    oder durch Aufruf von Buchungsfenstern. (Klicken Sie dazu jeweils auf die Schaltfläche \"Buchung\" und beenden"]
["    Sie die Eingabe  mit \"OK\".)"]
["    Die Kontennummern sind vierstellig anzugeben. (siehe Kontenplan). Bei zusammengesetzten Buchungssätzen"]
["    sind die Buchungen nach der Höhe der Beträge geordnet vorzunehmen. "]
[]
["3. Sie können sich den Kontenplan mit Kontennummern jederzeit durch Klick auf den"]
["    entsprechenden Button anzeigen lassen."]
[]
["4. Die Richtigkeit Ihrer Buchungen wird bestätigt oder Sie werden auf"]
["    Fehler hingewiesen. (Ohne Buchung werden Fehler angezeigt.)"]
[]
["5. Hauptbuch, Gewinn und Verlust und Bilanzbuch werden automatisch erstellt. "]

{"sheet":"Grundbuch","index":1,"n_rows":128,"n_cols":7,"rows_kept":128,"cut":false,"hidden":false,"merged":[[127,0,127,6],[5,5,5,6],[6,5,6,6],[7,5,7,6],[9,0,10,0],[9,1,10,1],[9,2,10,2],[9,3,10,3],[9,4,10,4],[9,5,10,5],[23,0,24,0],[5,1,7,3],[16,0,17,0],[19,1,21,3],[23,1,24,1],[23,2,24,2],[23,3,24,3],[12,5,12,6],[13,5,13,6],[14,5,14,6],[9,6,10,6],[1,0,1,4],[2,0,2,4],[26,1,28,3],[26,5,26,6],[27,5,27,6],[28,5,28,6],[19,5,19,6],[20,5,20,6],[21,5,21,6],[23,5,24,5],[23,6,24,6],[23,4,24,4],[30,6,31,6],[33,1,35,3],[33,5,33,6],[34,5,34,6],[35,5,35,6],[30,0,31,0],[30,1,31,1],[30,2,31,2],[30,3,31,3],[37,0,38,0],[37,1,38,1],[37,2,38,2],[37,3,38,3],[30,4,31,4],[30,5,31,5],[37,4,38,4],[37,5,38,5],[37,6,38,6],[40,1,42,3],[40,5,40,6],[41,5,41,6],[42,5,42,6],[44,6,45,6],[47,1,49,3],[47,5,47,6],[48,5,48,6],[49,5,49,6],[44,0,45,0],[44,1,45,1],[44,2,45,2],[44,3,45,3],[51,0,52,0],[51,1,52,1],[51,2,52,2],[51,3,52,3],[44,4,45,4],[44,5,45,5],[51,4,52,4],[51,5,52,5],[51,6,52,6],[54,1,56,3],[54,5,54,6],[55,5,55,6],[56,5,56,6],[58,4,59,4],[58,5,59,5],[58,6,59,6],[61,5,61,6],[58,0,59,0],[58,1,59,1],[58,2,59,2],[58,3,59,3],[62,5,62,6],[63,5,63,6],[65,0,66,0],[68,1,70,3],[68,5,68,6],[69,5,69,6],[70,5,70,6],[72,6,73,6],[75,1,77,3],[75,5,75,6],[76,5,76,6],[77,5,77,6],[72,0,73,0],[72,1,73,1],[72,2,73,2],[72,3,73,3],[79,0,80,0],[79,1,80,1],[79,2,80,2],[79,3,80,3],[72,4,73,4],[72,5,73,5],[79,4,80,4],[79,5,80,5],[79,6,80,6],[82,1,84,3],[82,5,82,6],[83,5,83,6],[84,5,84,6],[86,4,87,4],[86,5,87,5],[86,6,87,6],[89,5,90,6],[86,0,87,0],[86,1,87,1],[86,2,87,2],[86,3,87,3],[91,5,91,6],[92,5,92,6],[94,0,96,0],[98,1,100,3],[98,5,98,6],[99,5,99,6],[100,5,100,6],[114,5,114,6],[102,4,103,4],[102,5,103,5],[102,6,103,6],[105,5,105,6],[102,0,103,0],[102,1,103,1],[102,2,103,2],[102,3,103,3],[116,0,117,0],[116,1,117,1],[116,2,117,2],[116,3,117,3],[106,5,106,6],[107,5,107,6],[109,0,110,0],[112,1,114,3],[112,5,112,6],[113,5,113,6],[116,4,117,4],[116,5,117,5],[116,6,117,6],[119,1,121,3],[119,5,119,6],[120,5,120,6],[121,5,121,6],[123,4,124,4],[123,5,124,5],[123,6,124,6],[123,0,124,0],[123,1,124,1],[123,2,124,2],[123,3,124,3]]}
[]
["Geschäftsvorfälle"]
["Grundbuch"]
[]
[]
["1.","Einkauf von drei Monitoren gegen Bankscheck,",null,null,1200,{"$f":"IF(AND(B10=\"0800\",E10=\"2800\"),\"Die Konten sind richtig!\",\"Mindestens ein Konto ist falsch!\")","v":"Mindestens ein Konto ist falsch!"}]
["Geschäftsvorfall",null,null,null,null,{"$f":"IF(AND(D10=E6,G10=E6),\"Die Beträge sind richtig!\",\"Mindestens ein Betrag ist falsch!\")","v":"Mindestens ein Betrag ist falsch!"}]
[null,null,null,null,null,{"$f":"IF(AND(F6=\"Die Konten sind richtig!\",F7=\"Die Beträge sind richtig!\"),\"Alles richtig!\",\"Es sind noch Fehler vorhanden!\")","v":"Es sind noch Fehler vorhanden!"}]
[null,"Soll","Konto","€","Haben","Konto","€"]
["Buchungssatz","",{"$f":"IF(B10=\"\",\"\",VLOOKUP(B10,Kontenplan!$A$4:$B$38,2))","v":""},null,"",{"$f":"IF(E10=\"\",\"\",VLOOKUP(E10,Kontenplan!$A$4:$B$38,2))","v":""}]
[]
[]
["2.","Banklastschrift für - Löhne",null,null,12500,{"$f":"IF(AND(B17=\"6200\",B18=\"6300\",E17=\"2800\"),\"Die Konten sind richtig!\",\"Mindestens ein Konto ist falsch!\")","v":"Mindestens ein Konto ist falsch!"}]
["Geschäftsvorfall",null,"       - Gehälter",null,9200,{"$f":"IF(AND(D17=E13,D18=E14,G17=E15),\"Die Beträge sind richtig!\",\"Mindestens ein Betrag ist falsch!\")","v":"Mindestens ein Betrag ist falsch!"}]
[null,null,"         Banklastschrift",null,{"$f":"SUM(E13:E14)","v":21700},{"$f":"IF(AND(F13=\"Die Konten sind richtig!\",F14=\"Die Beträge sind richtig!\"),\"Alles richtig!\",\"Es sind noch Fehler vorhanden!\")","v":"Es sind noch Fehler vorhanden!"}]
[null,"Soll","Konto","€","Haben","Konto","€"]
["Buchungssatz","",{"$f":"IF(B17=\"\",\"\",VLOOKUP(B17,Kontenplan!$A$4:$B$38,2))","v":""},null,"",{"$f":"IF(E17=\"\",\"\",VLOOKUP(E17,Kontenplan!$A$4:$B$38,2))","v":""}]
[null,"",{"$f":"IF(B18=\"\",\"\",VLOOKUP(B18,Kontenplan!$A$4:$B$38,2))","v":""}]
[]
["3.","Bankgutschrift für Provisionen,",null,null,1500,{"$f":"IF(AND(B24=\"2800\",E24=\"5410\"),\"Die Konten sind richtig!\",\"Mindestens ein Konto ist falsch!\")","v":"Mindestens ein Konto ist falsch!"}]
["Geschäftsvorfall",null,null,null,null,{"$f":"IF(AND(D24=E20,G24=E20),\"Die Beträge sind richtig!\",\"Mindestens ein Betrag ist falsch!\")","v":"Mindestens ein Betrag ist falsch!"}]
[null,null,null,null,null,{"$f":"IF(AND(F20=\"Die Konten sind richtig!\",F21=\"Die Beträge sind richtig!\"),\"Alles richtig!\",\"Es sind noch Fehler vorhanden!\")","v":"Es sind noch Fehler vorhanden!"}]
[null,"Soll","Konto","€","Haben","Konto","€"]
["Buchungssatz","",{"$f":"IF(B24=\"\",\"\",VLOOKUP(B24,Kontenplan!$A$4:$B$38,2))","v":""},null,"",{"$f":"IF(E24=\"\",\"\",VLOOKUP(E24,Kontenplan!$A$4:$B$38,2))","v":""}]
[]
[]
["4.","Barzahlung für eine Kfz-Reparatur,",null,null,440,{"$f":"IF(AND(B31=\"6160\",E31=\"2880\"),\"Die Konten sind richtig!\",\"Mindestens ein Konto ist falsch!\")","v":"Mindestens ein Konto ist falsch!"}]
["Geschäftsvorfall",null,null,null,null,{"$f":"IF(AND(D31=E27,G31=E27),\"Die Beträge sind richtig!\",\"Mindestens ein Betrag ist falsch!\")","v":"Mindestens ein Betrag ist falsch!"}]
[null,null,null,null,null,{"$f":"IF(AND(F27=\"Die Konten sind richtig!\",F28=\"Die Beträge sind richtig!\"),\"Alles richtig!\",\"Es sind noch Fehler vorhanden!\")","v":"Es sind noch Fehler vorhanden!"}]
[null,"Soll","Konto","€","Haben","Konto","€"]
["Buchungssatz","",{"$f":"IF(B31=\"\",\"\",VLOOKUP(B31,Kontenplan!$A$4:$B$38,2))","v":""},null,"",{"$f":"IF(E31=\"\",\"\",VLOOKUP(E31,Kontenplan!$A$4:$B$38,2))","v":""}]
[]
[]
["5.","Bareinkauf von Briefumschlägen,",null,null,240,{"$f":"IF(AND(B38=\"6800\",E38=\"2880\"),\"Die Konten sind richtig!\",\"Mindestens ein Konto ist falsch!\")","v":"Mindestens ein Konto ist falsch!"}]
["Geschäftsvorfall",null,null,null,null,{"$f":"IF(AND(D38=E34,G38=E34),\"Die Beträge sind richtig!\",\"Mindestens ein Betrag ist falsch!\")","v":"Mindestens ein Betrag ist falsch!"}]
[null,null,null,null,null,{"$f":"IF(AND(F34=\"Die Konten sind richtig!\",F35=\"Die Beträge sind richtig!\"),\"Alles richtig!\",\"Es sind noch Fehler vorhanden!\")","v":"Es sind noch Fehler vorhanden!"}]
[null,"Soll","Konto","€","Haben","Konto","€"]
["Buchungssatz","",{"$f":"IF(B38=\"\",\"\",VLOOKUP(B38,Kontenplan!$A$4:$B$38,2))","v":""},null,"",{"$f":"IF(E38=\"\",\"\",VLOOKUP(E38,Kontenplan!$A$4:$B$38,2))","v":""}]
[]
[]
["6.","Die Bank belastet uns mit Zinsen,",null,null,160,{"$f":"IF(AND(B45=\"7510\",E45=\"2800\"),\"Die Konten sind richtig!\",\"Mindestens ein Konto ist falsch!\")","v":"Mindestens ein Konto ist falsch!"}]
["Geschäftsvorfall",null,null,null,null,{"$f":"IF(AND(D45=E41,G45=E41),\"Die Beträge sind richtig!\",\"Mindestens ein Betrag ist falsch!\")","v":"Mindestens ein Betrag ist falsch!"}]
[null,null,null,null,null,{"$f":"IF(AND(F41=\"Die Konten sind richtig!\",F42=\"Die Beträge sind richtig!\"),\"Alles richtig!\",\"Es sind noch Fehler vorhanden!\")","v":"Es sind noch Fehler vorhanden!"}]
[null,"Soll","Konto","€","Haben","Konto","€"]
["Buchungssatz","",{"$f":"IF(B45=\"\",\"\",VLOOKUP(B45,Kontenplan!$A$4:$B$38,2))","v":""},null,"",{"$f":"IF(E45=\"\",\"\",VLOOKUP(E45,Kontenplan!$A$4:$B$38,2))","v":""}]
[]
[]
["7.","Zieleinkauf von Garnen,",null,null,330,{"$f":"IF(AND(B52=\"2020\",E52=\"4400\"),\"Die Konten sind richtig!\",\"Mindestens ein Konto ist falsch!\")","v":"Mindestens ein Konto ist falsch!"}]
["Geschäftsvorfall",null,null,null,null,{"$f":"IF(AND(D52=E48,G52=E48),\"Die Beträge sind richtig!\",\"Mindestens ein Betrag ist falsch!\")","v":"Mindestens ein Betrag ist falsch!"}]
[null,null,null,null,null,{"$f":"IF(AND(F48=\"Die Konten sind richtig!\",F49=\"Die Beträge sind richtig!\"),\"Alles richtig!\",\"Es sind noch Fehler vorhanden!\")","v":"Es sind noch Fehler vorhanden!"}]
[null,"Soll","Konto","€","Haben","Konto","€"]
["Buchungssatz","",{"$f":"IF(B52=\"\",\"\",VLOOKUP(B52,Kontenplan!$A$4:$B$38,2))","v":""},null,"",{"$f":"IF(E52=\"\",\"\",VLOOKUP(E52,Kontenplan!$A$4:$B$38,2))","v":""}]
[]
[]
["8.","Barverkauf von T-Shirts,",null,null,2250,{"$f":"IF(AND(B59=\"2880\",E59=\"5000\"),\"Die Konten sind richtig!\",\"Mindestens ein Konto ist falsch!\")","v":"Mindestens ein Konto ist falsch!"}]
["Geschäftsvorfall",null,null,null,null,{"$f":"IF(AND(D59=E55,G59=E55),\"Die Beträge sind richtig!\",\"Mindestens ein Betrag ist falsch!\")","v":"Mindestens ein Betrag ist falsch!"}]
[null,null,null,null,null,{"$f":"IF(AND(F55=\"Die Konten sind richtig!\",F56=\"Die Beträge sind richtig!\"),\"Alles richtig!\",\"Es sind noch Fehler vorhanden!\")","v":"Es sind noch Fehler vorhanden!"}]
[null,"Soll","Konto","€","Haben","Konto","€"]
["Buchungssatz","",{"$f":"IF(B59=\"\",\"\",VLOOKUP(B59,Kontenplan!$A$4:$B$38,2))","v":""},null,"",{"$f":"IF(E59=\"\",\"\",VLOOKUP(E59,Kontenplan!$A$4:$B$38,2))","v":""}]
[]
[]
["9.","Bankgutschrift für - Zinsen",null,null,450,{"$f":"IF(AND(B66=\"2800\",E67=\"5400\",E66=\"5710\"),\"Die Konten sind richtig!\",\"Mindestens ein Konto ist falsch!\")","v":"Mindestens ein Konto ist falsch!"}]
["Geschäftsvorfall",null,"      - vermietete Lagerräume",null,2400,{"$f":"IF(AND(D66=E64,G66=E62,G67=E63),\"Die Beträge sind richtig!\",\"Mindestens ein Betrag ist falsch!\")","v":"Mindestens ein Betrag ist falsch!"}]
[null,null,"         Bankguschrift",null,{"$f":"SUM(E62:E63)","v":2850},{"$f":"IF(AND(F62=\"Die Konten sind richtig!\",F63=\"Die Beträge sind richtig!\"),\"Alles richtig!\",\"Es sind noch Fehler vorhanden!\")","v":"Es sind noch Fehler vorhanden!"}]
[null,"Soll","Konto","€","Haben","Konto","€"]
["Buchungssatz","",{"$f":"IF(B66=\"\",\"\",VLOOKUP(B66,Kontenplan!$A$4:$B$38,2))","v":""},null,"",{"$f":"IF(E66=\"\",\"\",VLOOKUP(E66,Kontenplan!$A$4:$B$38,2))","v":""}]
[null,null,{"$f":"IF(B67=\"\",\"\",VLOOKUP(B67,Kontenplan!$A$4:$B$38,2))","v":""},null,"",{"$f":"IF(E67=\"\",\"\",VLOOKUP(E67,Kontenplan!$A$4:$B$38,2))","v":""}]
[]
["10.","Banklastschrift für Kontoführung,",null,null,45,{"$f":"IF(AND(B73=\"6750\",E73=\"2800\"),\"Die Konten sind richtig!\",\"Mindestens ein Konto ist falsch!\")","v":"Mindestens ein Konto ist falsch!"}]
["Geschäftsvorfall",null,null,null,null,{"$f":"IF(AND(D73=E69,G73=E69),\"Die Beträge sind richtig!\",\"Mindestens ein Betrag ist falsch!\")","v":"Mindestens ein Betrag ist falsch!"}]
[null,null,null,null,null,{"$f":"IF(AND(F69=\"Die Konten sind richtig!\",F70=\"Die Beträge sind richtig!\"),\"Alles richtig!\",\"Es sind noch Fehler vorhanden!\")","v":"Es sind noch Fehler vorhanden!"}]
[null,"Soll","Konto","€","Haben","Konto","€"]
["Buchungssatz","",{"$f":"IF(B73=\"\",\"\",VLOOKUP(B73,Kontenplan!$A$4:$B$38,2))","v":""},null,"",{"$f":"IF(E73=\"\",\"\",VLOOKUP(E73,Kontenplan!$A$4:$B$38,2))","v":""}]
[]
[]
["11.","Verkauf von Jeans und Jeansjacken auf Ziel,",null,null,25500,{"$f":"IF(AND(B80=\"2400\",E80=\"5000\"),\"Die Konten sind richtig!\",\"Mindestens ein Konto ist falsch!\")","v":"Mindestens ein Konto ist falsch!"}]
["Geschäftsvorfall",null,null,null,null,{"$f":"IF(AND(D80=E76,G80=E76),\"Die Beträge sind richtig!\",\"Mindestens ein Betrag ist falsch!\")","v":"Mindestens ein Betrag ist falsch!"}]
[null,null,null,null,null,{"$f":"IF(AND(F76=\"Die Konten sind richtig!\",F77=\"Die Beträge sind richtig!\"),\"Alles richtig!\",\"Es sind noch Fehler vorhanden!\")","v":"Es sind noch Fehler vorhanden!"}]
[null,"Soll","Konto","€","Haben","Konto","€"]
["Buchungssatz","",{"$f":"IF(B80=\"\",\"\",VLOOKUP(B80,Kontenplan!$A$4:$B$38,2))","v":""},null,"",{"$f":"IF(E80=\"\",\"\",VLOOKUP(E80,Kontenplan!$A$4:$B$38,2))","v":""}]
{"$rows_left_out":49}
{"sheet":"Hauptbuch","index":2,"n_rows":123,"n_cols":10,"rows_kept":123,"cut":false,"hidden":false,"merged":[[26,1,26,8],[31,1,31,8],[34,1,34,8],[37,1,37,8],[42,1,42,8],[52,1,52,8],[0,0,0,9],[2,1,2,8],[5,1,5,8],[8,1,8,8],[16,1,16,8],[21,1,21,8],[119,1,119,8],[64,1,64,8],[86,1,86,8],[95,1,95,8],[89,1,89,8],[92,1,92,8],[72,1,72,8],[98,1,98,8],[116,1,116,8],[113,1,113,8],[110,1,110,8],[13,1,13,8],[101,1,101,8],[80,1,80,8],[107,1,107,8],[77,1,77,8],[83,1,83,8],[104,1,104,8],[59,1,59,8],[67,1,67,8]]}
["Hauptbuch"]
[]
["Soll","0510 Bebaute Grundstücke",null,null,null,null,null,null,null,"Haben"]
["AB","8000",null,null,{"$f":"Bilanzbuch!C4","v":250000},"SB",8010,null,null,{"$f":"E4","v":250000}]
[]
["Soll","0700 Technische Anlagen und Maschinen",null,null,null,null,null,null,null,"Haben"]
["AB","8000",null,null,{"$f":"Bilanzbuch!C5","v":180000},"SB",8010,null,null,{"$f":"E7","v":180000}]
[]
["Soll","0800 Betriebs- und Geschäftsausstattung",null,null,null,null,null,null,null,"Haben"]
["AB","8000",null,null,{"$f":"Bilanzbuch!C7","v":43600},"12.","2880",null,null,{"$f":"Grundbuch!G87","v":0}]
["1.",2800,null,null,{"$f":"Grundbuch!D10","v":0},"SB",8010,null,null,{"$f":"J12-J10","v":43600}]
[null,null,null,null,{"$f":"SUM(E10:E11)","v":43600},null,null,null,null,{"$f":"E12","v":43600}]
[]
["Soll","0840 Fuhrpark",null,null,null,null,null,null,null,"Haben"]
["AB","8000",null,null,{"$f":"Bilanzbuch!C6","v":68000},"SB",8010,null,null,{"$f":"E15","v":68000}]
[]
["Soll","2000 Rohstoffe",null,null,null,null,null,null,null,"Haben"]
["AB","8000",null,null,{"$f":"Bilanzbuch!C8","v":180000},"13.","6000",null,null,{"$f":"Grundbuch!G95","v":0}]
[null,null,null,null,null,"SB",8010,null,null,{"$f":"J20-J18","v":180000}]
[null,null,null,null,{"$f":"SUM(E18:E19)","v":180000},null,null,null,null,{"$f":"E20","v":180000}]
[]
["Soll","2020 Hilfsstoffe",null,null,null,null,null,null,null,"Haben"]
["AB","8000",null,null,{"$f":"Bilanzbuch!C9","v":12500},"13.","6020",null,null,{"$f":"Grundbuch!G96","v":0}]
["7.","4400",null,null,{"$f":"Grundbuch!D52","v":0},"SB",8010,null,null,{"$f":"J25-J23","v":12500}]
[null,null,null,null,{"$f":"SUM(E23:E24)","v":12500},null,null,null,null,{"$f":"E25","v":12500}]
[]
["Soll","2030 Betriebsstoffe",null,null,null,null,null,null,null,"Haben"]
["AB","8000",null,null,{"$f":"Bilanzbuch!C10","v":3500},"13.","6030",null,null,{"$f":"Grundbuch!G97","v":0}]
[null,null,null,null,null,"SB",8010,null,null,{"$f":"J30-J28","v":3500}]
[null,null,null,null,{"$f":"SUM(E28:E29)","v":3500},null,null,null,null,{"$f":"E30","v":3500}]
[]
["Soll","2100 Unfertige Erzeugnisse",null,null,null,null,null,null,null,"Haben"]
["AB","8000",null,null,{"$f":"Bilanzbuch!C11","v":16700},"SB",null,null,null,{"$f":"E33","v":16700}]
[]
["Soll","2200 Fertige Erzeugnisse",null,null,null,null,null,null,null,"Haben"]
["AB","8000",null,null,{"$f":"Bilanzbuch!C12","v":24300},"SB",null,null,null,{"$f":"E36","v":24300}]
[]
["Soll","2400 Forderungen aus Lieferungen und Leistungen",null,null,null,null,null,null,null,"Haben"]
["AB","8000",null,null,{"$f":"Bilanzbuch!C13","v":39800},"14.",2800,null,null,{"$f":"Grundbuch!G103","v":0}]
["11.",5000,null,null,{"$f":"Grundbuch!D80","v":0},"SB",8010,null,null,{"$f":"J41-J39","v":39800}]
[null,null,null,null,{"$f":"SUM(E39:E40)","v":39800},null,null,null,null,{"$f":"E41","v":39800}]
[]
["Soll","2800 Kreditinstitute/Bank",null,null,null,null,null,null,null,"Haben"]
["AB","8000",null,null,{"$f":"Bilanzbuch!C14","v":71200},"1.","0800",null,null,{"$f":"Grundbuch!G10","v":0}]
["3.","5410",null,null,{"$f":"Grundbuch!D24","v":0},"2.",6200,6300,null,{"$f":"Grundbuch!G17","v":0}]
["9.","5710","5400",null,{"$f":"Grundbuch!D66","v":0},"6.",7510,null,null,{"$f":"Grundbuch!G45","v":0}]
["14.","2400",null,null,{"$f":"Grundbuch!D103","v":0},"10.",6750,null,null,{"$f":"Grundbuch!G73","v":0}]
[null,null,null,null,null,"15.",7000,6900,null,{"$f":"Grundbuch!G110","v":0}]
[null,null,null,null,null,"16.",4400,null,null,{"$f":"Grundbuch!G117","v":0}]
[null,null,null,null,null,"SB",8010,null,null,{"$f":"J51-SUM(J44:J49)","v":71200}]
[null,null,null,null,{"$f":"SUM(E44:E50)","v":71200},null,null,null,null,{"$f":"E51","v":71200}]
[]
["Soll","2880 Kasse",null,null,null,null,null,null,null,"Haben"]
["AB","8000",null,null,{"$f":"Bilanzbuch!C15","v":4790},"4.","6160",null,null,{"$f":"Grundbuch!G31","v":0}]
["8.","5000",null,null,{"$f":"Grundbuch!D59","v":0},"6.","6800",null,null,{"$f":"Grundbuch!G38","v":0}]
["12.","0800",null,null,{"$f":"Grundbuch!D87","v":0},"17.","6860",null,null,{"$f":"Grundbuch!G124","v":0}]
[null,null,null,null,null,"SB",8010,null,null,{"$f":"J58-SUM(J54:J56)","v":4790}]
[null,null,null,null,{"$f":"SUM(E54:E57)","v":4790},null,null,null,null,{"$f":"E58","v":4790}]
[]
["Soll","3000 Eigenkapital",null,null,null,null,null,null,null,"Haben"]
["A",8020,null,null,{"$f":"IF(GuV!F16>0,GuV!F16,0)","v":0},"AB",8000,null,null,{"$f":"Bilanzbuch!F4","v":416490}]
["SB",8010,null,null,{"$f":"E63-E61","v":416490},"A",8020,null,null,{"$f":"IF(GuV!C16>0,GuV!C16,0)","v":0}]
[null,null,null,null,{"$f":"J63","v":416490},null,null,null,null,{"$f":"SUM(J61:J62)","v":416490}]
[]
["Soll","4200 Verbindlichkeiten gegenüber Kreditinsituten",null,null,null,null,null,null,null,"Haben"]
["SB","8000",null,null,{"$f":"Bilanzbuch!F5","v":410000},"AB",8000,null,null,{"$f":"Bilanzbuch!F5","v":410000}]
[]
["Soll","4400 Verbindlichkeiten aus Lieferungen und Leistungen",null,null,null,null,null,null,null,"Haben"]
["16.",2800,null,null,{"$f":"Grundbuch!D117","v":0},"AB",8000,null,null,{"$f":"Bilanzbuch!F6","v":67900}]
["SB",8010,null,null,{"$f":"E71-E69","v":67900},"7.","2020",null,null,{"$f":"Grundbuch!G52","v":0}]
[null,null,null,null,{"$f":"J71","v":67900},null,null,null,null,{"$f":"SUM(J69:J70)","v":67900}]
[]
["Soll","5000 Umsatzerlöse",null,null,null,null,null,null,null,"Haben"]
["A",8020,null,null,{"$f":"E76","v":0},"8.","2880",null,null,{"$f":"Grundbuch!G59","v":0}]
[null,null,null,null,null,"11.","2400",null,null,{"$f":"Grundbuch!G80","v":0}]
[null,null,null,null,{"$f":"J76","v":0},null,null,null,null,{"$f":"SUM(J74:J75)","v":0}]
[]
["Soll","5400 Mieterträge",null,null,null,null,null,null,null,"Haben"]
["A","8020",null,null,{"$f":"J79","v":0},"9.",2800,null,null,{"$f":"Grundbuch!G67","v":0}]
[]
{"$rows_left_out":44}
{"sheet":"GuV","index":3,"n_rows":17,"n_cols":6,"rows_kept":17,"cut":false,"hidden":false,"merged":[[0,0,0,5],[2,1,2,4]]}
["Gewinn- und Verlustrechnung"]
[]
["Soll","8020 Gewinn und Verlust",null,null,null,"Haben"]
["6000","Aufwendungen für Rohstoffe",{"$f":"Hauptbuch!J88","v":0},"5000","Umsatzerlöse",{"$f":"Hauptbuch!E74","v":0}]
["6020","Aufwendungen für Hilfsstoffe",{"$f":"Hauptbuch!E91","v":0},"5400","Mieterträge",{"$f":"Hauptbuch!E79","v":0}]
["6030","Aufwendungen für Betriebsstoffe",{"$f":"Hauptbuch!J94","v":0},"5410","Sonstige Erlöse (Provisionen)",{"$f":"Hauptbuch!E82","v":0}]
["6160","Fremdinstandhaltung",{"$f":"Hauptbuch!J97","v":0},"5710","Zinserträge",{"$f":"Hauptbuch!E85","v":0}]
["6200","Löhne",{"$f":"Hauptbuch!J100","v":0}]
["6300","Gehälter",{"$f":"Hauptbuch!J103","v":0}]
["6750","Kosten des Geldverkehrs",{"$f":"Hauptbuch!J106","v":0}]
["6800","Büromaterial",{"$f":"Hauptbuch!J109","v":0}]
["6860","Bewirtung und Präsentation",{"$f":"Hauptbuch!J112","v":0}]
["6900","Versicherungsbeiträge",{"$f":"Hauptbuch!J115","v":0}]
["7000","Betriebliche Steuern",{"$f":"Hauptbuch!J118","v":0}]
["7510","Zinsaufwendungen",{"$f":"Hauptbuch!J121","v":0}]
[{"$f":"IF(SUM($F$4:$F$7)>SUM($C$4:$C$15),\"3000\",\"\")","v":""},{"$f":"IF(SUM($F$4:$F$7)>SUM($C$4:$C$15),\"Eigenkapital\",\"\")","v":""},{"$f":"IF(SUM($F$4:$F$7)>SUM($C$4:$C$15),SUM($F$4:$F$7)-SUM($C$4:$C$15),0)","v":0},{"$f":"IF(SUM($F$4:$F$7)<SUM($C$4:$C$15),\"3000\",\"\")","v":""},{"$f":"IF(SUM($F$4:$F$7)<SUM($C$4:$C$15),\"Eigenkapital\",\"\")","v":""},{"$f":"IF(SUM($F$4:$F$7)<SUM($C$4:$C$15),SUM($C$4:$C$15)-SUM($F$4:$F$7),0)","v":0}]
[null,null,{"$f":"IF(SUM($F$4:$F$7)>SUM($C$4:$C$15),SUM($F$4:$F$7),SUM($C$4:$C$15))","v":0},null,null,{"$f":"IF(SUM($F$4:$F$7)>SUM($C$4:$C$15),SUM($F$4:$F$7),SUM($C$4:$C$15))","v":0}]

{"sheet":"Bilanzbuch","index":4,"n_rows":31,"n_cols":6,"rows_kept":31,"cut":false,"hidden":false,"merged":[[2,1,2,4],[0,0,0,5],[17,1,17,4]]}
["Bilanzbuch"]
[]
["Aktiva","8000 Eröffnungsbilanz",null,null,null,"Passiva"]
["0510","Bebaute Grundstücke",250000,"3000","Eigenkapital",{"$f":"F16-SUM(F5:F15)","v":416490}]
["0700","Technische Anlagen und Maschinen",180000,"4200","Verbindlichkeiten g. Kreditinstituten",410000]
["0840","Fuhrpark",68000,"4400","Verbindlichkeiten a.L.u.L.",67900]
["0800","Betriebs- und Geschäftsausstattung",43600]
["2000","Rohstoffe",180000]
["2020","Hilfsstoffe",12500]
["2040","Betriebsstoffe",3500]
["2100","Unfertige Erzeugnisse",16700]
["2200","Fertige Erzeugnisse",24300]
["2400","Forderungen a.L.u.L.",39800]
["2800","Bank",71200]
["2880","Kasse",4790]
[null,null,{"$f":"SUM(C4:C15)","v":894390},null,null,{"$f":"C16","v":894390}]
[]
["Aktiva","8010 Schlussbilanz",null,null,null,"Passiva"]
["0510","Bebaute Grundstücke",{"$f":"Hauptbuch!J4","v":250000},"3000","Eigenkapital",{"$f":"Hauptbuch!E62","v":416490}]
["0700","Technische Anlagen und Maschinen",{"$f":"Hauptbuch!J7","v":180000},"4200","Verbindlichkeiten g. Kreditinstituten",{"$f":"Hauptbuch!E66","v":410000}]
["0800","Betriebs- und Geschäftsausstattung",{"$f":"Hauptbuch!J11","v":43600},"4400","Verbindlichkeiten a.L.u.L.",{"$f":"Hauptbuch!E70","v":67900}]
["0840","Fuhrpark",{"$f":"Hauptbuch!J15","v":68000}]
["2000","Rohstoffe",{"$f":"Hauptbuch!J19","v":180000}]
["2020","Hilfsstoffe",{"$f":"Hauptbuch!J24","v":12500}]
["2040","Betriebsstoffe",{"$f":"Hauptbuch!J29","v":3500}]
["2100","Unfertige Erzeugnisse",{"$f":"Hauptbuch!J33","v":16700}]
["2200","Fertige Erzeugnisse",{"$f":"Hauptbuch!J36","v":24300}]
["2400","Forderungen a.L.u.L.",{"$f":"Hauptbuch!J40","v":39800}]
["2800","Bank",{"$f":"Hauptbuch!J50","v":71200}]
["2880","Kasse",{"$f":"Hauptbuch!J57","v":4790}]
[null,null,{"$f":"SUM(C19:C30)","v":894390},null,null,{"$f":"SUM(F19:F30)","v":894390}]

{"sheet":"Kontenplan","index":5,"n_rows":38,"n_cols":2,"rows_kept":38,"cut":false,"hidden":false,"merged":[]}
[null,"Kontenplan"]
[]
["Nr.","Konto"]
["0510","Bebaute Grundstücke"]
["0700","Technische Anlagen und Maschinen"]
["0800","Betriebs- und Geschäftsausstattung"]
["0840","Fuhrpark"]
["2000","Rohstoffe"]
["2020","Hilfsstoffe"]
["2030","Betriebsstoffe"]
["2040","Betriebsstoffe"]
["2100","Unfertige Erzeugnisse"]
["2200","Fertige Erzeugnisse"]
["2400","Forderungen a.L.u.L."]
["2800","Kreditinstitute/Bank"]
["2880","Kasse"]
["3000","Eigenkapital"]
["4200","Verbindlichkeiten g. Kreditinstituten"]
["4400","Verbindlichkeiten a.L.u.L."]
["5000","Umsatzerlöse"]
["5400","Mieterträge"]
["5410","Sonstige Erlöse (Provisionen)"]
["5710","Zinserträge"]
["6000","Aufwendungen für Rohstoffe"]
["6020","Aufwendungen für Hilfsstoffe"]
["6030","Aufwendungen für Betriebsstoffe"]
["6160","Fremdinstandhaltung"]
["6200","Löhne"]
["6300","Gehälter"]
["6750","Kosten des Geldverkehrs"]
["6800","Büromaterial"]
["6860","Bewirtung und Präsentation"]
["6900","Versicherungsbeiträge"]
["7000","Betriebliche Steuern"]
["7510","Zinsaufwendungen"]
["8000","Eröffnungsbilanz"]
["8010","Schlussbilanz"]
["8020","Gewinn und Verlust"]