{"text_format":"1","workbook":"xlsx","n_sheets":6,"sheets":["Hinweise","Grundbuch","Hauptbuch","GuV","Bilanzbuch","Kontenplan"],"not_rendered":{"charts":0,"images":26,"macros":1,"external_links":0,"defined_names":0,"comments":0,"pivot_tables":0},"unopened":[],"bounds":{"document_bytes":16777216,"sheet_cells":100000,"rows_first":2000,"rows_last":500,"rows_between":2000,"halvings":0,"cell_chars":16384,"cell_head_chars":4096},"cells_cut":0,"cells_raw":0,"read":"whole","date_system":"1900"}

{"sheet":"Hinweise","index":0,"n_rows":28,"n_cols":1,"rows_kept":28,"cut":false,"hidden":false,"merged":[[0,0,0,7],[2,0,2,1],[4,0,9,3]]}
["Geschäftsgang 18"]
[]
["Voraussetzungen"]
["Um den Geschäftsgang buchen zu können müssen Sie Kenntnisse über die folgenden Lehrninhalte haben:"]
["Buchungen auf Bestandskonten, Buchungen auf Erfolgskonten, Bestandsveränderungen, Abschreibungen, Umsatzsteuer, Buchung von Bezugskosten, Buchung von Nachlässen und Erlösberichtigungen"]
[]
[]
[]
[]
[]
[]
["Vorgehensweise"]
["1. Wählen Sie die Tabelle \"Grundbuch\"."]
[]
["2. Buchen Sie die Geschäftsvorfälle"]
["    entweder durch Direkteingabe in die entsprechenden Felder des Grundbuchs (Kontennummern und Beträge)"]
["    oder durch Aufruf von Buchungsfenstern. (Klicken Sie dazu jeweils auf die Schaltfläche \"Buchung\" und beenden"]
["    Sie die Eingabe  mit \"OK\".)"]
["    Die Kontennummern sind vierstellig anzugeben. (siehe Kontenplan). Bei zusammengesetzten Buchungssätzen"]
["    sind die Buchungen nach der Höhe der Beträge geordnet vorzunehmen. "]
[]
["3. Sie können sich den Kontenplan mit Kontennummern jederzeit durch Klick auf den"]
["    entsprechenden Button anzeigen lassen."]
[]
["4. Die Richtigkeit Ihrer Buchungen wird bestätigt oder Sie werden auf"]
["    Fehler hingewiesen. (Ohne Buchung werden Fehler angezeigt.)"]
[]
["5. Hauptbuch, Gewinn und Verlust und Bilanzbuch werden automatisch erstellt. "]

{"sheet":"Grundbuch","index":1,"n_rows":170,"n_cols":7,"rows_kept":170,"cut":false,"hidden":false,"merged":[[9,4,10,4],[139,5,139,6],[9,6,10,6],[149,0,151,0],[5,5,5,6],[6,5,6,6],[7,5,7,6],[9,0,10,0],[9,1,10,1],[9,2,10,2],[9,3,10,3],[125,5,125,6],[9,5,10,5],[141,0,142,0],[144,1,147,2],[144,5,145,6],[146,5,146,6],[147,5,147,6],[137,1,139,2],[137,5,137,6],[138,5,138,6],[156,5,156,6],[165,0,167,0],[116,1,118,2],[116,5,116,6],[117,5,117,6],[118,5,118,6],[120,0,121,0],[123,1,125,2],[123,5,123,6],[124,5,124,6],[111,5,111,6],[113,0,114,0],[161,5,161,6],[162,5,162,6],[163,5,163,6],[127,0,128,0],[130,1,132,2],[130,5,130,6],[131,5,131,6],[132,5,132,6],[100,5,101,6],[102,5,102,6],[103,5,103,6],[105,0,107,0],[109,5,109,6],[110,5,110,6],[36,5,36,6],[37,5,37,6],[31,0,33,0],[23,0,24,0],[26,1,29,2],[26,5,27,6],[28,5,28,6],[29,5,29,6],[50,5,50,6],[51,5,51,6],[58,5,58,6],[16,0,17,0],[35,1,37,2],[19,5,19,6],[20,5,20,6],[21,5,21,6],[19,1,21,2],[35,5,35,6],[80,5,80,6],[74,0,75,0],[70,1,72,2],[71,5,71,6],[72,5,72,6],[12,1,14,2],[12,5,12,6],[13,5,13,6],[14,5,14,6],[49,5,49,6],[46,0,47,0],[56,1,58,2],[70,5,70,6],[169,0,169,6],[1,0,1,4],[2,0,2,4],[67,0,68,0],[77,1,80,2],[77,5,78,6],[79,5,79,6],[49,1,51,2],[56,5,56,6],[57,5,57,6],[154,5,154,6],[155,5,155,6],[39,0,40,0],[42,1,44,2],[42,5,42,6],[43,5,43,6],[44,5,44,6],[60,0,61,0],[63,1,65,2],[63,5,63,6],[64,5,64,6],[65,5,65,6],[53,0,54,0],[93,5,93,6],[97,0,98,0],[94,5,94,6],[95,5,95,6],[82,0,84,0],[86,1,88,2],[86,5,86,6],[87,5,87,6],[88,5,88,6],[161,1,161,3],[162,1,162,3],[163,1,163,3],[90,0,91,0],[93,1,95,2],[153,0,153,2],[109,1,111,2],[158,0,159,0],[134,0,135,0]]}
[]
["Geschäftsvorfälle"]
["Grundbuch"]
[null,null,null,null,null,null,0.19]
[]
["1.","Banküberweisung der Umsatzsteuer-Zahllast,",null,null,{"$f":"Bilanzbuch!F7","v":10400},{"$f":"IF(AND(B10=\"4800\",E10=\"2800\"),\"Die Konten sind richtig!\",\"Mindestens ein Konto ist falsch!\")","v":"Mindestens ein Konto ist falsch!"}]
["Geschäftsvorfall",null,null,null,null,{"$f":"IF(AND(D10=E6,G10=E6),\"Die Beträge sind richtig!\",\"Mindestens ein Betrag ist falsch!\")","v":"Mindestens ein Betrag ist falsch!"}]
[null,null,null,null,null,{"$f":"IF(AND(F6=\"Die Konten sind richtig!\",F7=\"Die Beträge sind richtig!\"),\"Alles richtig!\",\"Es sind noch Fehler vorhanden!\")","v":"Es sind noch Fehler vorhanden!"}]
[null,"Soll","Konto","€","Haben","Konto","€"]
["Buchungssatz","",{"$f":"IF(B10=\"\",\"\",VLOOKUP(B10,Kontenplan!$A$4:$B$35,2))","v":""},null,"",{"$f":"IF(E10=\"\",\"\",VLOOKUP(E10,Kontenplan!$A$4:$B$35,2))","v":""}]
[]
[]
["2.","Zieleinkauf von Baumwollstoffen bei der Baumwollweberei Kaiser OHG, ",null,"netto",21300,{"$f":"IF(AND(B17=\"2000\",B18=\"2600\",E17=\"4400\"),\"Die Konten sind richtig!\",\"Mindestens ein Konto ist falsch!\")","v":"Mindestens ein Konto ist falsch!"}]
["Geschäftsvorfall",null,null,"USt.",{"$f":"E13*$G$4","v":4047},{"$f":"IF(AND(D17=E13,D18=E14,G17=E15),\"Die Beträge sind richtig!\",\"Mindestens ein Betrag ist falsch!\")","v":"Mindestens ein Betrag ist falsch!"}]
[null,null,null,"brutto",{"$f":"SUM(E13:E14)","v":25347},{"$f":"IF(AND(F13=\"Die Konten sind richtig!\",F14=\"Die Beträge sind richtig!\"),\"Alles richtig!\",\"Es sind noch Fehler vorhanden!\")","v":"Es sind noch Fehler vorhanden!"}]
[null,"Soll","Konto","€","Haben","Konto","€"]
["Buchungssatz","",{"$f":"IF(B17=\"\",\"\",VLOOKUP(B17,Kontenplan!$A$4:$B$35,2))","v":""},null,"",{"$f":"IF(E17=\"\",\"\",VLOOKUP(E17,Kontenplan!$A$4:$B$35,2))","v":""}]
[null,"",{"$f":"IF(B18=\"\",\"\",VLOOKUP(B18,Kontenplan!$A$4:$B$35,2))","v":""},null,null,{"$f":"IF(E18=\"\",\"\",VLOOKUP(E18,Kontenplan!$A$4:$B$35,2))","v":""}]
[]
["3.","Barzahlung für Installationsarbeiten am Computernetzwerk der Tropic GmbH,",null,"netto",450,{"$f":"IF(AND(B24=\"6160\",B25=\"2600\",E24=\"2880\"),\"Die Konten sind richtig!\",\"Mindestens ein Konto ist falsch!\")","v":"Mindestens ein Konto ist falsch!"}]
["Geschäftsvorfall",null,null,"USt.",{"$f":"E20*$G$4","v":85.5},{"$f":"IF(AND(D24=E20,D25=E21,G24=E22),\"Die Beträge sind richtig!\",\"Mindestens ein Betrag ist falsch!\")","v":"Mindestens ein Betrag ist falsch!"}]
[null,null,null,"brutto",{"$f":"SUM(E20:E21)","v":535.5},{"$f":"IF(AND(F20=\"Die Konten sind richtig!\",F21=\"Die Beträge sind richtig!\"),\"Alles richtig!\",\"Es sind noch Fehler vorhanden!\")","v":"Es sind noch Fehler vorhanden!"}]
[null,"Soll","Konto","€","Haben","Konto","€"]
["Buchungssatz","",{"$f":"IF(B24=\"\",\"\",VLOOKUP(B24,Kontenplan!$A$4:$B$35,2))","v":""},null,"",{"$f":"IF(E24=\"\",\"\",VLOOKUP(E24,Kontenplan!$A$4:$B$35,2))","v":""}]
[null,"",{"$f":"IF(B25=\"\",\"\",VLOOKUP(B25,Kontenplan!$A$4:$B$35,2))","v":""},null,null,{"$f":"IF(E25=\"\",\"\",VLOOKUP(E25,Kontenplan!$A$4:$B$35,2))","v":""}]
[]
["4.","Die Boutique Marinas Collection GmbH begleicht eine Ausgangsrechnung abzüglich 3% Skonto durch Banküberweisung, ",null,"Gutschrift",{"$f":"E30-E29-E28","v":23086},{"$f":"IF(AND(B32=\"2800\",B33=\"5001\",B34=\"4800\",E32=\"2400\"),\"Die Konten sind richtig!\",\"Mindestens ein Konto ist falsch!\")","v":"Mindestens ein Konto ist falsch!"}]
[null,null,null,"Skonto",{"$f":"ROUND((E30*3%)-((E30*3%)/(100+($G$4*100))*($G$4*100)),2)","v":600}]
["Geschäftsvorfall",null,null,"USt.",{"$f":"ROUND(E28*$G$4,2)","v":114},{"$f":"IF(AND(D32=E27,D33=E28,D34=E29,G32=E30),\"Die Beträge sind richtig!\",\"Mindestens ein Betrag ist falsch!\")","v":"Mindestens ein Betrag ist falsch!"}]
[null,null,null,"Bruttobetrag",23800,{"$f":"IF(AND(F27=\"Die Konten sind richtig!\",F29=\"Die Beträge sind richtig!\"),\"Alles richtig!\",\"Es sind noch Fehler vorhanden!\")","v":"Es sind noch Fehler vorhanden!"}]
[null,"Soll","Konto","€","Haben","Konto","€"]
["Buchungssatz","",{"$f":"IF(B32=\"\",\"\",VLOOKUP(B32,Kontenplan!$A$4:$B$35,2))","v":""},null,"",{"$f":"IF(E32=\"\",\"\",VLOOKUP(E32,Kontenplan!$A$4:$B$35,2))","v":""}]
[null,"",{"$f":"IF(B33=\"\",\"\",VLOOKUP(B33,Kontenplan!$A$4:$B$35,2))","v":""},null,null,{"$f":"IF(E33=\"\",\"\",VLOOKUP(E33,Kontenplan!$A$4:$B$35,2))","v":""}]
[null,"",{"$f":"IF(B34=\"\",\"\",VLOOKUP(B34,Kontenplan!$A$4:$B$35,2))","v":""},null,null,{"$f":"IF(E34=\"\",\"\",VLOOKUP(E34,Kontenplan!$A$4:$B$35,2))","v":""}]
[]
["5.","Bezugskosten für den Einkauf aus Geschäftsvorfall 2 bar,",null,"netto",870,{"$f":"IF(AND(B40=\"2001\",B41=\"2600\",E40=\"2880\"),\"Die Konten sind richtig!\",\"Mindestens ein Konto ist falsch!\")","v":"Mindestens ein Konto ist falsch!"}]
["Geschäftsvorfall",null,null,"USt.",{"$f":"E36*$G$4","v":165.3},{"$f":"IF(AND(D40=E36,D41=E37,G40=E38),\"Die Beträge sind richtig!\",\"Mindestens ein Betrag ist falsch!\")","v":"Mindestens ein Betrag ist falsch!"}]
[null,null,null,"brutto",{"$f":"SUM(E36:E37)","v":1035.3},{"$f":"IF(AND(F36=\"Die Konten sind richtig!\",F37=\"Die Beträge sind richtig!\"),\"Alles richtig!\",\"Es sind noch Fehler vorhanden!\")","v":"Es sind noch Fehler vorhanden!"}]
[null,"Soll","Konto","€","Haben","Konto","€"]
["Buchungssatz","",{"$f":"IF(B40=\"\",\"\",VLOOKUP(B40,Kontenplan!$A$4:$B$35,2))","v":""},null,"",{"$f":"IF(E40=\"\",\"\",VLOOKUP(E40,Kontenplan!$A$4:$B$35,2))","v":""}]
[null,"",{"$f":"IF(B41=\"\",\"\",VLOOKUP(B41,Kontenplan!$A$4:$B$35,2))","v":""},null,null,{"$f":"IF(E41=\"\",\"\",VLOOKUP(E41,Kontenplan!$A$4:$B$35,2))","v":""}]
[]
["6.","Rücksendung beschädigter Rohstoffe aus Geschäftsvorfall 2. an Baumwollweberei Kaiser OHG,",null,"netto",1300,{"$f":"IF(AND(B47=\"4400\",E47=\"2000\",E48=\"2600\"),\"Die Konten sind richtig!\",\"Mindestens ein Konto ist falsch!\")","v":"Mindestens ein Konto ist falsch!"}]
["Geschäftsvorfall",null,null,"USt.",{"$f":"E43*$G$4","v":247},{"$f":"IF(AND(D47=E45,G47=E43,G48=E44),\"Die Beträge sind richtig!\",\"Mindestens ein Betrag ist falsch!\")","v":"Mindestens ein Betrag ist falsch!"}]
[null,null,null,"brutto",{"$f":"SUM(E43:E44)","v":1547},{"$f":"IF(AND(F43=\"Die Konten sind richtig!\",F44=\"Die Beträge sind richtig!\"),\"Alles richtig!\",\"Es sind noch Fehler vorhanden!\")","v":"Es sind noch Fehler vorhanden!"}]
[null,"Soll","Konto","€","Haben","Konto","€"]
["Buchungssatz","",{"$f":"IF(B47=\"\",\"\",VLOOKUP(B47,Kontenplan!$A$4:$B$35,2))","v":""},null,"",{"$f":"IF(E47=\"\",\"\",VLOOKUP(E47,Kontenplan!$A$4:$B$35,2))","v":""}]
[null,null,{"$f":"IF(B48=\"\",\"\",VLOOKUP(B48,Kontenplan!$A$4:$B$35,2))","v":""},null,"",{"$f":"IF(E48=\"\",\"\",VLOOKUP(E48,Kontenplan!$A$4:$B$35,2))","v":""}]
[]
["7.","Kauf eines Pkw auf Ziel, Listenpreis 34.000,00 Euro. Wir erhalten einen Treuerabatt von 10%. Zieleinkaufspreis: 30.600,00 Euro",null,"netto",30600,{"$f":"IF(AND(B54=\"0840\",B55=\"2600\",E54=\"4400\"),\"Die Konten sind richtig!\",\"Mindestens ein Konto ist falsch!\")","v":"Mindestens ein Konto ist falsch!"}]
["Geschäftsvorfall",null,null,"USt.",{"$f":"E50*$G$4","v":5814},{"$f":"IF(AND(D54=E50,D55=E51,G54=E52),\"Die Beträge sind richtig!\",\"Mindestens ein Betrag ist falsch!\")","v":"Mindestens ein Betrag ist falsch!"}]
[null,null,null,"brutto",{"$f":"SUM(E50:E51)","v":36414},{"$f":"IF(AND(F50=\"Die Konten sind richtig!\",F51=\"Die Beträge sind richtig!\"),\"Alles richtig!\",\"Es sind noch Fehler vorhanden!\")","v":"Es sind noch Fehler vorhanden!"}]
[null,"Soll","Konto","€","Haben","Konto","€"]
["Buchungssatz","",{"$f":"IF(B54=\"\",\"\",VLOOKUP(B54,Kontenplan!$A$4:$B$35,2))","v":""},null,"",{"$f":"IF(E54=\"\",\"\",VLOOKUP(E54,Kontenplan!$A$4:$B$35,2))","v":""}]
[null,"",{"$f":"IF(B55=\"\",\"\",VLOOKUP(B55,Kontenplan!$A$4:$B$35,2))","v":""},null,null,{"$f":"IF(E55=\"\",\"\",VLOOKUP(E55,Kontenplan!$A$4:$B$35,2))","v":""}]
[]
["8.","Wir gewähren der Boutique Marinas Collection GmbH einen Bonus,",null,"netto",450,{"$f":"IF(AND(B61=\"5001\",B62=\"4800\",E61=\"2400\"),\"Die Konten sind richtig!\",\"Mindestens ein Konto ist falsch!\")","v":"Mindestens ein Konto ist falsch!"}]
["Geschäftsvorfall",null,null,"USt.",{"$f":"E57*$G$4","v":85.5},{"$f":"IF(AND(D61=E57,D62=E58,G61=E59),\"Die Beträge sind richtig!\",\"Mindestens ein Betrag ist falsch!\")","v":"Mindestens ein Betrag ist falsch!"}]
[null,null,null,"brutto",{"$f":"SUM(E57:E58)","v":535.5},{"$f":"IF(AND(F57=\"Die Konten sind richtig!\",F58=\"Die Beträge sind richtig!\"),\"Alles richtig!\",\"Es sind noch Fehler vorhanden!\")","v":"Es sind noch Fehler vorhanden!"}]
[null,"Soll","Konto","€","Haben","Konto","€"]
["Buchungssatz","",{"$f":"IF(B61=\"\",\"\",VLOOKUP(B61,Kontenplan!$A$4:$B$35,2))","v":""},null,"",{"$f":"IF(E61=\"\",\"\",VLOOKUP(E61,Kontenplan!$A$4:$B$35,2))","v":""}]
[null,"",{"$f":"IF(B62=\"\",\"\",VLOOKUP(B62,Kontenplan!$A$4:$B$35,2))","v":""},null,null,{"$f":"IF(E62=\"\",\"\",VLOOKUP(E62,Kontenplan!$A$4:$B$35,2))","v":""}]
[]
["9.","Verkauf von fertigen Erzeugnissen gegen Rechnung,",null,"netto",53500,{"$f":"IF(AND(B68=\"2400\",E68=\"5000\",E69=\"4800\"),\"Die Konten sind richtig!\",\"Mindestens ein Konto ist falsch!\")","v":"Mindestens ein Konto ist falsch!"}]
["Geschäftsvorfall",null,null,"USt.",{"$f":"E64*$G$4","v":10165},{"$f":"IF(AND(D68=E66,G68=E64,G69=E65),\"Die Beträge sind richtig!\",\"Mindestens ein Betrag ist falsch!\")","v":"Mindestens ein Betrag ist falsch!"}]
[null,null,null,"brutto",{"$f":"SUM(E64:E65)","v":63665},{"$f":"IF(AND(F64=\"Die Konten sind richtig!\",F65=\"Die Beträge sind richtig!\"),\"Alles richtig!\",\"Es sind noch Fehler vorhanden!\")","v":"Es sind noch Fehler vorhanden!"}]
[null,"Soll","Konto","€","Haben","Konto","€"]
["Buchungssatz","",{"$f":"IF(B68=\"\",\"\",VLOOKUP(B68,Kontenplan!$A$4:$B$35,2))","v":""},null,"",{"$f":"IF(E68=\"\",\"\",VLOOKUP(E68,Kontenplan!$A$4:$B$35,2))","v":""}]
[null,null,{"$f":"IF(B69=\"\",\"\",VLOOKUP(B69,Kontenplan!$A$4:$B$35,2))","v":""},null,"",{"$f":"IF(E69=\"\",\"\",VLOOKUP(E69,Kontenplan!$A$4:$B$35,2))","v":""}]
[]
["10.","Wir zahlen die Kosten für den Transport der verkauften Produkte aus Geschäftsvorfall 9. bar,",null,"netto",1300,{"$f":"IF(AND(B75=\"6140\",B76=\"2600\",E75=\"2880\"),\"Die Konten sind richtig!\",\"Mindestens ein Konto ist falsch!\")","v":"Mindestens ein Konto ist falsch!"}]
["Geschäftsvorfall",null,null,"USt.",{"$f":"E71*$G$4","v":247},{"$f":"IF(AND(D75=E71,D76=E72,G75=E73),\"Die Beträge sind richtig!\",\"Mindestens ein Betrag ist falsch!\")","v":"Mindestens ein Betrag ist falsch!"}]
[null,null,null,"brutto",{"$f":"SUM(E71:E72)","v":1547},{"$f":"IF(AND(F71=\"Die Konten sind richtig!\",F72=\"Die Beträge sind richtig!\"),\"Alles richtig!\",\"Es sind noch Fehler vorhanden!\")","v":"Es sind noch Fehler vorhanden!"}]
[null,"Soll","Konto","€","Haben","Konto","€"]
["Buchungssatz","",{"$f":"IF(B75=\"\",\"\",VLOOKUP(B75,Kontenplan!$A$4:$B$35,2))","v":""},null,"",{"$f":"IF(E75=\"\",\"\",VLOOKUP(E75,Kontenplan!$A$4:$B$35,2))","v":""}]
[null,"",{"$f":"IF(B76=\"\",\"\",VLOOKUP(B76,Kontenplan!$A$4:$B$35,2))","v":""},null,null,{"$f":"IF(E76=\"\",\"\",VLOOKUP(E76,Kontenplan!$A$4:$B$35,2))","v":""}]
[]
["11.","Banküberweisung der Eingangsrechnung für Bauwollstoffe aus Geschäftsvorfall 2, unter Berücksichtigung der Rücksendung aus Geschäftsvorfall 6. und Abzug von 2% Skonto.",null,"Lastschrift",{"$f":"E81-E79-E80","v":23324},{"$f":"IF(AND(B83=\"4400\",E83=\"2800\",E84=\"2002\",E85=\"2600\"),\"Die Konten sind richtig!\",\"Mindestens ein Konto ist falsch!\")","v":"Mindestens ein Konto ist falsch!"}]
[null,null,null,"Skonto",{"$f":"ROUND((E81*2%)-((E81*2%)/(100+($G$4*100))*($G$4*100)),2)","v":400}]
["Geschäftsvorfall",null,null,"USt.",{"$f":"ROUND(E79*$G$4,2)","v":76},{"$f":"IF(AND(D83=E81,E81,G83=E78,G84=E79,G85=E80),\"Die Beträge sind richtig!\",\"Mindestens ein Betrag ist falsch!\")","v":"Mindestens ein Betrag ist falsch!"}]
[null,null,null,"Bruttobetrag",{"$f":"E15-E45","v":23800},{"$f":"IF(AND(F78=\"Die Konten sind richtig!\",F80=\"Die Beträge sind richtig!\"),\"Alles richtig!\",\"Es sind noch Fehler vorhanden!\")","v":"Es sind noch Fehler vorhanden!"}]
[null,"Soll","Konto","€","Haben","Konto","€"]
["Buchungssatz","",{"$f":"IF(B83=\"\",\"\",VLOOKUP(B83,Kontenplan!$A$4:$B$35,2))","v":""},null,"",{"$f":"IF(E83=\"\",\"\",VLOOKUP(E83,Kontenplan!$A$4:$B$35,2))","v":""}]
[null,null,{"$f":"IF(B84=\"\",\"\",VLOOKUP(B84,Kontenplan!$A$4:$B$35,2))","v":""},null,"",{"$f":"IF(E84=\"\",\"\",VLOOKUP(E84,Kontenplan!$A$4:$B$35,2))","v":""}]
[null,null,{"$f":"IF(B85=\"\",\"\",VLOOKUP(B85,Kontenplan!$A$4:$B$35,2))","v":""},null,"",{"$f":"IF(E85=\"\",\"\",VLOOKUP(E85,Kontenplan!$A$4:$B$35,2))","v":""}]
[]
["12.","Wir erhalten von einem Rohstofflieferanten einen Preisnachlass aufgrund eines Mangels an gelieferter Ware,",null,"netto",950,{"$f":"IF(AND(B91=\"4400\",E91=\"2002\",E92=\"2600\"),\"Die Konten sind richtig!\",\"Mindestens ein Konto ist falsch!\")","v":"Mindestens ein Konto ist falsch!"}]
["Geschäftsvorfall",null,null,"USt.",{"$f":"E87*$G$4","v":180.5},{"$f":"IF(AND(D91=E89,G91=E87,G92=E88),\"Die Beträge sind richtig!\",\"Mindestens ein Betrag ist falsch!\")","v":"Mindestens ein Betrag ist falsch!"}]
[null,null,null,"brutto",{"$f":"SUM(E87:E88)","v":1130.5},{"$f":"IF(AND(F87=\"Die Konten sind richtig!\",F88=\"Die Beträge sind richtig!\"),\"Alles richtig!\",\"Es sind noch Fehler vorhanden!\")","v":"Es sind noch Fehler vorhanden!"}]
[null,"Soll","Konto","€","Haben","Konto","€"]
["Buchungssatz","",{"$f":"IF(B91=\"\",\"\",VLOOKUP(B91,Kontenplan!$A$4:$B$35,2))","v":""},null,"",{"$f":"IF(E91=\"\",\"\",VLOOKUP(E91,Kontenplan!$A$4:$B$35,2))","v":""}]
[null,null,{"$f":"IF(B92=\"\",\"\",VLOOKUP(B92,Kontenplan!$A$4:$B$35,2))","v":""},null,"",{"$f":"IF(E92=\"\",\"\",VLOOKUP(E92,Kontenplan!$A$4:$B$35,2))","v":""}]
[]
["13.","Barkauf von Werbegeschenken für die Kunden der Tropic GmbH, ",null,"netto",860,{"$f":"IF(AND(B98=\"6870\",B99=\"2600\",E98=\"2880\"),\"Die Konten sind richtig!\",\"Mindestens ein Konto ist falsch!\")","v":"Mindestens ein Konto ist falsch!"}]
["Geschäftsvorfall",null,null,"USt.",{"$f":"E94*$G$4","v":163.4},{"$f":"IF(AND(D98=E94,D99=E95,G98=E96),\"Die Beträge sind richtig!\",\"Mindestens ein Betrag ist falsch!\")","v":"Mindestens ein Betrag ist falsch!"}]
[null,null,null,"brutto",{"$f":"SUM(E94:E95)","v":1023.4},{"$f":"IF(AND(F94=\"Die Konten sind richtig!\",F95=\"Die Beträge sind richtig!\"),\"Alles richtig!\",\"Es sind noch Fehler vorhanden!\")","v":"Es sind noch Fehler vorhanden!"}]
[null,"Soll","Konto","€","Haben","Konto","€"]
["Buchungssatz","",{"$f":"IF(B98=\"\",\"\",VLOOKUP(B98,Kontenplan!$A$4:$B$35,2))","v":""},null,"",{"$f":"IF(E98=\"\",\"\",VLOOKUP(E98,Kontenplan!$A$4:$B$35,2))","v":""}]
[null,"",{"$f":"IF(B99=\"\",\"\",VLOOKUP(B99,Kontenplan!$A$4:$B$35,2))","v":""},null,null,{"$f":"IF(E99=\"\",\"\",VLOOKUP(E99,Kontenplan!$A$4:$B$35,2))","v":""}]
[]
["14.","Stoffverbrauch lt. Materialentnahmescheine für",null,null,null,{"$f":"IF(AND(B106=\"6000\",E106=\"2000\",B107=\"6020\",E107=\"2020\",B108=\"6030\",E108=\"2030\"),\"Die Konten sind richtig!\",\"Mindestens ein Konto ist falsch!\")","v":"Mindestens ein Konto ist falsch!"}]
["Geschäftsvorfall",null,"           - Rohstoffe",null,28000]
[null,null,"           - Hilfsstoffe",null,6500,{"$f":"IF(AND(D106=E102,D107=E103,D108=E104,G106=E102,G107=E103,G108=E104),\"Die Beträge sind richtig!\",\"Mindestens ein Betrag ist falsch!\")","v":"Mindestens ein Betrag ist falsch!"}]
[null,null,"           - Betriebsstoffe",null,1400,{"$f":"IF(AND(F101=\"Die Konten sind richtig!\",F103=\"Die Beträge sind richtig!\"),\"Alles richtig!\",\"Es sind noch Fehler vorhanden!\")","v":"Es sind noch Fehler vorhanden!"}]
[null,"Soll","Konto","€","Haben","Konto","€"]
["Buchungssatz","",{"$f":"IF(B106=\"\",\"\",VLOOKUP(B106,Kontenplan!$A$4:$B$35,2))","v":""},null,"",{"$f":"IF(E106=\"\",\"\",VLOOKUP(E106,Kontenplan!$A$4:$B$35,2))","v":""}]
[null,"",{"$f":"IF(B107=\"\",\"\",VLOOKUP(B107,Kontenplan!$A$4:$B$35,2))","v":""},null,"",{"$f":"IF(E107=\"\",\"\",VLOOKUP(E107,Kontenplan!$A$4:$B$35,2))","v":""}]
[null,"",{"$f":"IF(B108=\"\",\"\",VLOOKUP(B108,Kontenplan!$A$4:$B$35,2))","v":""},null,"",{"$f":"IF(E108=\"\",\"\",VLOOKUP(E108,Kontenplan!$A$4:$B$35,2))","v":""}]
[]
["15.","Verkauf von Jeans und Jeansjacken auf Ziel,",null,"netto",38000,{"$f":"IF(AND(B114=\"2400\",E114=\"5000\",E115=\"4800\"),\"Die Konten sind richtig!\",\"Mindestens ein Konto ist falsch!\")","v":"Mindestens ein Konto ist falsch!"}]
["Geschäftsvorfall",null,null,"USt.",{"$f":"E110*$G$4","v":7220},{"$f":"IF(AND(D114=E112,G114=E110,G115=E111),\"Die Beträge sind richtig!\",\"Mindestens ein Betrag ist falsch!\")","v":"Mindestens ein Betrag ist falsch!"}]
[null,null,null,"brutto",{"$f":"SUM(E110:E111)","v":45220},{"$f":"IF(AND(F110=\"Die Konten sind richtig!\",F111=\"Die Beträge sind richtig!\"),\"Alles richtig!\",\"Es sind noch Fehler vorhanden!\")","v":"Es sind noch Fehler vorhanden!"}]
[null,"Soll","Konto","€","Haben","Konto","€"]
["Buchungssatz","",{"$f":"IF(B114=\"\",\"\",VLOOKUP(B114,Kontenplan!$A$4:$B$35,2))","v":""},null,"",{"$f":"IF(E114=\"\",\"\",VLOOKUP(E114,Kontenplan!$A$4:$B$35,2))","v":""}]
[null,null,{"$f":"IF(B115=\"\",\"\",VLOOKUP(B115,Kontenplan!$A$4:$B$35,2))","v":""},null,"",{"$f":"IF(E115=\"\",\"\",VLOOKUP(E115,Kontenplan!$A$4:$B$35,2))","v":""}]
[]
["16.","Verkauf eines nicht mehr genutzten Pkw aus dem Bestand der Tropic GmbH gegen Barzahlung,",null,"netto",1200,{"$f":"IF(AND(B121=\"2880\",E121=\"0840\",E122=\"4800\"),\"Die Konten sind richtig!\",\"Mindestens ein Konto ist falsch!\")","v":"Mindestens ein Konto ist falsch!"}]
["Geschäftsvorfall",null,null,"USt.",{"$f":"E117*$G$4","v":228},{"$f":"IF(AND(D121=E119,G121=E117,G122=E118),\"Die Beträge sind richtig!\",\"Mindestens ein Betrag ist falsch!\")","v":"Mindestens ein Betrag ist falsch!"}]
[null,null,null,"brutto",{"$f":"SUM(E117:E118)","v":1428},{"$f":"IF(AND(F117=\"Die Konten sind richtig!\",F118=\"Die Beträge sind richtig!\"),\"Alles richtig!\",\"Es sind noch Fehler vorhanden!\")","v":"Es sind noch Fehler vorhanden!"}]
[null,"Soll","Konto","€","Haben","Konto","€"]
["Buchungssatz","",{"$f":"IF(B121=\"\",\"\",VLOOKUP(B121,Kontenplan!$A$4:$B$35,2))","v":""},null,"",{"$f":"IF(E121=\"\",\"\",VLOOKUP(E121,Kontenplan!$A$4:$B$35,2))","v":""}]
[null,null,{"$f":"IF(B122=\"\",\"\",VLOOKUP(B122,Kontenplan!$A$4:$B$35,2))","v":""},null,"",{"$f":"IF(E122=\"\",\"\",VLOOKUP(E122,Kontenplan!$A$4:$B$35,2))","v":""}]
[]
["17.","Banküberweisung an eine Werbeagentur für die Herstellung von Werbeanzeigen,",null,"netto",4800,{"$f":"IF(AND(B128=\"6870\",B129=\"2600\",E128=\"2800\"),\"Die Konten sind richtig!\",\"Mindestens ein Konto ist falsch!\")","v":"Mindestens ein Konto ist falsch!"}]
["Geschäftsvorfall",null,null,"USt.",{"$f":"E124*$G$4","v":912},{"$f":"IF(AND(D128=E124,D129=E125,G128=E126),\"Die Beträge sind richtig!\",\"Mindestens ein Betrag ist falsch!\")","v":"Mindestens ein Betrag ist falsch!"}]
[null,null,null,"brutto",{"$f":"SUM(E124:E125)","v":5712},{"$f":"IF(AND(F124=\"Die Konten sind richtig!\",F125=\"Die Beträge sind richtig!\"),\"Alles richtig!\",\"Es sind noch Fehler vorhanden!\")","v":"Es sind noch Fehler vorhanden!"}]
[null,"Soll","Konto","€","Haben","Konto","€"]
["Buchungssatz","",{"$f":"IF(B128=\"\",\"\",VLOOKUP(B128,Kontenplan!$A$4:$B$35,2))","v":""},null,"",{"$f":"IF(E128=\"\",\"\",VLOOKUP(E128,Kontenplan!$A$4:$B$35,2))","v":""}]
[null,"",{"$f":"IF(B129=\"\",\"\",VLOOKUP(B129,Kontenplan!$A$4:$B$35,2))","v":""},null,null,{"$f":"IF(E129=\"\",\"\",VLOOKUP(E129,Kontenplan!$A$4:$B$35,2))","v":""}]
[]
["18.","Verkauf von von Parykleidern und Rippkleidern in verschiedenen Größen an die Kick Moden GmbH gegen Rechnung,",null,"netto",3200,{"$f":"IF(AND(B135=\"2400\",E135=\"5000\",E136=\"4800\"),\"Die Konten sind richtig!\",\"Mindestens ein Konto ist falsch!\")","v":"Mindestens ein Konto ist falsch!"}]
["Geschäftsvorfall",null,null,"USt.",{"$f":"E131*$G$4","v":608},{"$f":"IF(AND(D135=E133,G135=E131,G136=E132),\"Die Beträge sind richtig!\",\"Mindestens ein Betrag ist falsch!\")","v":"Mindestens ein Betrag ist falsch!"}]
[null,null,null,"brutto",{"$f":"SUM(E131:E132)","v":3808},{"$f":"IF(AND(F131=\"Die Konten sind richtig!\",F132=\"Die Beträge sind richtig!\"),\"Alles richtig!\",\"Es sind noch Fehler vorhanden!\")","v":"Es sind noch Fehler vorhanden!"}]
[null,"Soll","Konto","€","Haben","Konto","€"]
["Buchungssatz","",{"$f":"IF(B135=\"\",\"\",VLOOKUP(B135,Kontenplan!$A$4:$B$35,2))","v":""},null,"",{"$f":"IF(E135=\"\",\"\",VLOOKUP(E135,Kontenplan!$A$4:$B$35,2))","v":""}]
[null,null,{"$f":"IF(B136=\"\",\"\",VLOOKUP(B136,Kontenplan!$A$4:$B$35,2))","v":""},null,"",{"$f":"IF(E136=\"\",\"\",VLOOKUP(E136,Kontenplan!$A$4:$B$35,2))","v":""}]
[]
["19.","Rücksendung von falsch gelieferten Größen aus dem Verkauf von Geschäftsvorfall 18, ",null,"netto",700,{"$f":"IF(AND(B142=\"5000\",B143=\"4800\",E142=\"2400\"),\"Die Konten sind richtig!\",\"Mindestens ein Konto ist falsch!\")","v":"Mindestens ein Konto ist falsch!"}]
["Geschäftsvorfall",null,null,"USt.",{"$f":"E138*$G$4","v":133},{"$f":"IF(AND(D142=E138,D143=E139,G142=E140),\"Die Beträge sind richtig!\",\"Mindestens ein Betrag ist falsch!\")","v":"Mindestens ein Betrag ist falsch!"}]
[null,null,null,"brutto",{"$f":"SUM(E138:E139)","v":833},{"$f":"IF(AND(F138=\"Die Konten sind richtig!\",F139=\"Die Beträge sind richtig!\"),\"Alles richtig!\",\"Es sind noch Fehler vorhanden!\")","v":"Es sind noch Fehler vorhanden!"}]
[null,"Soll","Konto","€","Haben","Konto","€"]
["Buchungssatz","",{"$f":"IF(B142=\"\",\"\",VLOOKUP(B142,Kontenplan!$A$4:$B$35,2))","v":""},null,"",{"$f":"IF(E142=\"\",\"\",VLOOKUP(E142,Kontenplan!$A$4:$B$35,2))","v":""}]
[null,"",{"$f":"IF(B143=\"\",\"\",VLOOKUP(B143,Kontenplan!$A$4:$B$35,2))","v":""},null,null,{"$f":"IF(E143=\"\",\"\",VLOOKUP(E143,Kontenplan!$A$4:$B$35,2))","v":""}]
[]
["20.","Die Kick Moden GmbH begleicht die Ausgangsrechnung unter Berücksichtigung der Rücksendung abzüglich 2% Skonto durch Banküberweisung, ",null,"Gutschrift",{"$f":"E148-E147-E146","v":2915.5},{"$f":"IF(AND(B150=\"2800\",B151=\"5001\",B152=\"4800\",E150=\"2400\"),\"Die Konten sind richtig!\",\"Mindestens ein Konto ist falsch!\")","v":"Mindestens ein Konto ist falsch!"}]
[null,null,null,"Skonto",{"$f":"ROUND((E148*2%)-((E148*2%)/(100+($G$4*100))*($G$4*100)),2)","v":50}]
["Geschäftsvorfall",null,null,"USt.",{"$f":"ROUND(E146*$G$4,2)","v":9.5},{"$f":"IF(AND(D150=E145,D151=E146,D152=E147,G150=E148),\"Die Beträge sind richtig!\",\"Mindestens ein Betrag ist falsch!\")","v":"Mindestens ein Betrag ist falsch!"}]
[null,null,null,"Bruttobetrag",{"$f":"E133-E140","v":2975},{"$f":"IF(AND(F145=\"Die Konten sind richtig!\",F147=\"Die Beträge sind richtig!\"),\"Alles richtig!\",\"Es sind noch Fehler vorhanden!\")","v":"Es sind noch Fehler vorhanden!"}]
[null,"Soll","Konto","€","Haben","Konto","€"]
["Buchungssatz","",{"$f":"IF(B150=\"\",\"\",VLOOKUP(B150,Kontenplan!$A$4:$B$35,2))","v":""},null,"",{"$f":"IF(E150=\"\",\"\",VLOOKUP(E150,Kontenplan!$A$4:$B$35,2))","v":""}]
[null,"",{"$f":"IF(B151=\"\",\"\",VLOOKUP(B151,Kontenplan!$A$4:$B$35,2))","v":""},null,null,{"$f":"IF(E151=\"\",\"\",VLOOKUP(E151,Kontenplan!$A$4:$B$35,2))","v":""}]
[null,"",{"$f":"IF(B152=\"\",\"\",VLOOKUP(B152,Kontenplan!$A$4:$B$35,2))","v":""},null,null,{"$f":"IF(E152=\"\",\"\",VLOOKUP(E152,Kontenplan!$A$4:$B$35,2))","v":""}]
[]
["Abschlussangaben"]
["A1","Endbestände lt. Inventur",null,null,null,{"$f":"IF(AND(B159=\"8010\",E159=\"2100\",B160=\"8010\",E160=\"2200\"),\"Die Konten sind richtig!\",\"Mindestens ein Konto ist falsch!\")","v":"Mindestens ein Konto ist falsch!"}]
["Abschlussangabe",null,"           - Unfertige Erzeugnisse",null,34000,{"$f":"IF(AND(D159=E156,D160=E157,G159=E156,G160=E157),\"Die Beträge sind richtig!\",\"Mindestens ein Betrag ist falsch!\")","v":"Mindestens ein Betrag ist falsch!"}]
[null,null,"           - Fertige Erzeugnisse",null,58000,{"$f":"IF(AND(F155=\"Die Konten sind richtig!\",F156=\"Die Beträge sind richtig!\"),\"Alles richtig!\",\"Es sind noch Fehler vorhanden!\")","v":"Es sind noch Fehler vorhanden!"}]
[null,"Soll","Konto","€","Haben","Konto","€"]
["Buchungssatz","",{"$f":"IF(B159=\"\",\"\",VLOOKUP(B159,Kontenplan!$A$4:$B$35,2))","v":""},null,"",{"$f":"IF(E159=\"\",\"\",VLOOKUP(E159,Kontenplan!$A$4:$B$35,2))","v":""}]
[null,"",{"$f":"IF(B160=\"\",\"\",VLOOKUP(B160,Kontenplan!$A$4:$B$35,2))","v":""},null,"",{"$f":"IF(E160=\"\",\"\",VLOOKUP(E160,Kontenplan!$A$4:$B$35,2))","v":""}]
[]
["A2","Abschreibungen:  - Technische Anlagen und Maschinen",null,null,23500,{"$f":"IF(AND(B166=\"6520\",E166=\"0700\",B167=\"6520\",E167=\"0800\",B168=\"6520\",E168=\"0840\"),\"Die Konten sind richtig!\",\"Mindestens ein Konto ist falsch!\")","v":"Mindestens ein Konto ist falsch!"}]
["Abschlussangabe","                          - Betriebs- und Geschäftsausstattung",null,null,12500,{"$f":"IF(AND(D166=E162,D167=E163,D168=E164,G166=E162,G167=E163,G168=E164),\"Die Beträge sind richtig!\",\"Mindestens ein Betrag ist falsch!\")","v":"Mindestens ein Betrag ist falsch!"}]
[null,"                          - Fuhrpark",null,null,14000,{"$f":"IF(AND(F162=\"Die Konten sind richtig!\",F163=\"Die Beträge sind richtig!\"),\"Alles richtig!\",\"Es sind noch Fehler vorhanden!\")","v":"Es sind noch Fehler vorhanden!"}]
[null,"Soll","Konto","€","Haben","Konto","€"]
["Buchungssatz","",{"$f":"IF(B166=\"\",\"\",VLOOKUP(B166,Kontenplan!$A$4:$B$35,2))","v":""},null,"",{"$f":"IF(E166=\"\",\"\",VLOOKUP(E166,Kontenplan!$A$4:$B$35,2))","v":""}]
[null,"",{"$f":"IF(B167=\"\",\"\",VLOOKUP(B167,Kontenplan!$A$4:$B$35,2))","v":""},null,"",{"$f":"IF(E167=\"\",\"\",VLOOKUP(E167,Kontenplan!$A$4:$B$35,2))","v":""}]
[null,"",{"$f":"IF(B168=\"\",\"\",VLOOKUP(B168,Kontenplan!$A$4:$B$35,2))","v":""},null,"",{"$f":"IF(E168=\"\",\"\",VLOOKUP(E168,Kontenplan!$A$4:$B$35,2))","v":""}]
[]
[{"$f":"IF(AND(F15=\"Alles richtig!\",F22=\"Alles richtig!\",F30=\"Alles richtig!\",F38=\"Alles richtig!\",F45=\"Alles richtig!\",F52=\"Alles richtig!\",F59=\"Alles richtig!\",F66=\"Alles richtig!\",F73=\"Alles richtig!\",F81=\"Alles richtig!\",F89=\"Alles richtig!\",F96=\"Alles richtig!\",F104=\"Alles richtig!\",F112=\"Alles richtig!\",F119=\"Alles richtig!\",F126=\"Alles richtig!\",F133=\"Alles richtig!\",F140=\"Alles richtig!\",F148=\"Alles richtig!\",F157=\"Alles richtig!\",F164=\"Alles richtig!\"),\"Super gebucht, die Aufgabe ist gelöst!\",\"Bilden Sie alle Buchungssätze!\")","v":"Bilden Sie alle Buchungssätze!"}]

{"sheet":"Hauptbuch","index":2,"n_rows":159,"n_cols":10,"rows_kept":159,"cut":false,"hidden":false,"merged":[[155,1,155,8],[52,1,52,8],[145,1,145,8],[121,1,121,8],[127,1,127,8],[133,1,133,8],[136,1,136,8],[139,1,139,8],[75,1,75,8],[115,1,115,8],[142,1,142,8],[149,1,149,8],[57,1,57,8],[95,1,95,8],[82,1,82,8],[90,1,90,8],[65,1,65,8],[105,1,105,8],[0,0,0,9],[2,1,2,8],[5,1,5,8],[10,1,10,8],[15,1,15,8],[21,1,21,8],[98,1,98,8],[47,1,47,8],[28,1,28,8],[31,1,31,8],[42,1,42,8],[36,1,36,8]]}
["Hauptbuch"]
[]
["Soll","0500 Grundstücke und Bauten",null,null,null,null,null,null,null,"Haben"]
["AB","8000",null,null,{"$f":"Bilanzbuch!C4","v":880000},"SB",8010,null,null,{"$f":"E4","v":880000}]
[]
["Soll","0700 Technische Anlagen und Maschinen",null,null,null,null,null,null,null,"Haben"]
["AB","8000",null,null,{"$f":"Bilanzbuch!C5","v":545000},"A2","6520",null,null,{"$f":"Grundbuch!G166","v":0}]
[null,null,null,null,null,"SB","8010",null,null,{"$f":"J9-J7","v":545000}]
[null,null,null,null,{"$f":"SUM(E7:E8)","v":545000},null,null,null,null,{"$f":"E9","v":545000}]
[]
["Soll","0800 Betriebs- und Geschäftsausstattung",null,null,null,null,null,null,null,"Haben"]
["AB","8000",null,null,{"$f":"Bilanzbuch!C6","v":125000},"A2","6520",null,null,{"$f":"Grundbuch!G167","v":0}]
[null,null,null,null,null,"SB","8010",null,null,{"$f":"J14-J12","v":125000}]
[null,null,null,null,{"$f":"SUM(E12:E13)","v":125000},null,null,null,null,{"$f":"E14","v":125000}]
[]
["Soll","0840 Fuhrpark",null,null,null,null,null,null,null,"Haben"]
["AB","8000",null,null,{"$f":"Bilanzbuch!C7","v":110000},"16.","2880",null,null,{"$f":"Grundbuch!G121","v":0}]
["7.","4400",null,null,{"$f":"Grundbuch!D54","v":0},"A2","6520",null,null,{"$f":"Grundbuch!G168","v":0}]
[null,null,null,null,null,"SB","8010",null,null,{"$f":"J20-J17-J18","v":110000}]
[null,null,null,null,{"$f":"SUM(E17:E19)","v":110000},null,null,null,null,{"$f":"E20","v":110000}]
[]
["Soll","2000 Rohstoffe",null,null,null,null,null,null,null,"Haben"]
["AB","8000",null,null,{"$f":"Bilanzbuch!C8","v":98000},"6.","4400",null,null,{"$f":"Grundbuch!G47","v":0}]
["A","2001",null,null,{"$f":"J30","v":0},"14.","6000",null,null,{"$f":"Grundbuch!G106","v":0}]
["2.","4400",null,null,{"$f":"Grundbuch!D17","v":0},"A","2002",null,null,{"$f":"E33","v":0}]
[null,null,null,null,null,"SB",8010,null,null,{"$f":"J27-SUM(J23:J25)","v":98000}]
[null,null,null,null,{"$f":"SUM(E23:E25)","v":98000},null,null,null,null,{"$f":"E27","v":98000}]
[]
["Soll","2001 Bezugskosten (Rohstoffe)",null,null,null,null,null,null,null,"Haben"]
["5.","2880",null,null,{"$f":"Grundbuch!D40","v":0},"A","2000",null,null,{"$f":"E30","v":0}]
[]
["Soll","2002 Nachlässe (Rohstoffe)",null,null,null,null,null,null,null,"Haben"]
["A","2000",null,null,{"$f":"E35","v":0},"11.","4400",null,null,{"$f":"Grundbuch!G84","v":0}]
[null,null,null,null,null,"12.","4400",null,null,{"$f":"Grundbuch!G91","v":0}]
[null,null,null,null,{"$f":"J35","v":0},null,null,null,null,{"$f":"J33+J34","v":0}]
[]
["Soll","2020 Hilfsstoffe",null,null,null,null,null,null,null,"Haben"]
["AB","8000",null,null,{"$f":"Bilanzbuch!C9","v":24000},"14.",6020,null,null,{"$f":"Grundbuch!G107","v":0}]
[null,null,null,null,null,"SB",8010,null,null,{"$f":"J40-J38","v":24000}]
[null,null,null,null,{"$f":"E38","v":24000},null,null,null,null,{"$f":"E40","v":24000}]
[]
[]
["Soll","2030 Betriebsstoffe",null,null,null,null,null,null,null,"Haben"]
["AB","8000",null,null,{"$f":"Bilanzbuch!C10","v":9200},"14.",6030,null,null,{"$f":"Grundbuch!G108","v":0}]
[null,null,null,null,null,"SB",8010,null,null,{"$f":"J46-J44","v":9200}]
[null,null,null,null,{"$f":"SUM(E44:E45)","v":9200},null,null,null,null,{"$f":"E46","v":9200}]
[]
["Soll","2100 Unfertige Erzeugnisse",null,null,null,null,null,null,null,"Haben"]
["AB","8000",null,null,{"$f":"Bilanzbuch!C11","v":24000},"A","8010",null,null,{"$f":"Grundbuch!G159","v":0}]
[{"$f":"IF(E49<J49,\"A\",\"\")","v":""},{"$f":"IF(E49<J49,5200,\"\")","v":""},null,null,{"$f":"IF(E49<J49,E51-E49,\"\")","v":""},{"$f":"IF(E49>J49,\"A\",\"\")","v":"A"},{"$f":"IF(J49<E49,5200,\"\")","v":5200},null,null,{"$f":"IF($E$49>$J$49,J51-J49,\"\")","v":24000}]
[null,null,null,null,{"$f":"IF($E$49>$J$49,$E$49,$J$49)","v":24000},null,null,null,null,{"$f":"IF($E$49>$J$49,$E$49,$J$49)","v":24000}]
[]
["Soll","2200 Fertige Erzeugnisse",null,null,null,null,null,null,null,"Haben"]
["AB","8000",null,null,{"$f":"Bilanzbuch!C12","v":46000},"A","8010",null,null,{"$f":"Grundbuch!G160","v":0}]
[{"$f":"IF(E54<J54,\"A\",\"\")","v":""},{"$f":"IF(E54<J54,5200,\"\")","v":""},null,null,{"$f":"IF(E54<E56,E56-E54,\"\")","v":""},{"$f":"IF(J54<E54,\"A\",\"\")","v":"A"},{"$f":"IF(J54<E54,5200,\"\")","v":5200},null,null,{"$f":"IF(J54<E54,J56-J54,\"\")","v":46000}]
[null,null,null,null,{"$f":"IF(E54>J54,E54,J54)","v":46000},null,null,null,null,{"$f":"IF(E54>J54,E54,J54)","v":46000}]
[]
["Soll","2400 Forderungen aus Lieferungen und Leistungen",null,null,null,null,null,null,null,"Haben"]
["AB","8000",null,null,{"$f":"Bilanzbuch!C13","v":84000},"4.","2800","5001",4800,{"$f":"Grundbuch!G32","v":0}]
["9.","5000","4800",null,{"$f":"Grundbuch!D68","v":0},"8.","5001","4800",null,{"$f":"Grundbuch!G61","v":0}]
["15.","5000","4800",null,{"$f":"Grundbuch!D114","v":0},"19.","5000","4800",null,{"$f":"Grundbuch!G142","v":0}]
["18.","5000","4800",null,{"$f":"Grundbuch!D135","v":0},"20.","2800","5001",4800,{"$f":"Grundbuch!G150","v":0}]
[null,null,null,null,null,"SB","8010",null,null,{"$f":"J64-SUM(J59:J62)","v":84000}]
[null,null,null,null,{"$f":"SUM(E59:E63)","v":84000},null,null,null,null,{"$f":"E64","v":84000}]
[]
["Soll","2600 Vorsteuer",null,null,null,null,null,null,null,"Haben"]
["2.","4400",null,null,{"$f":"Grundbuch!D18","v":0},"6.","4400",null,null,{"$f":"Grundbuch!G48","v":0}]
["3.","2880",null,null,{"$f":"Grundbuch!D25","v":0},"11.","4400",null,null,{"$f":"Grundbuch!G85","v":0}]
["5.","2880",null,null,{"$f":"Grundbuch!D41","v":0},"12.","4400",null,null,{"$f":"Grundbuch!G92","v":0}]
["7.","4400",null,null,{"$f":"Grundbuch!D55","v":0},"A","4800",null,null,{"$f":"J74-SUM(J67:J69)","v":0}]
["10.","2880",null,null,{"$f":"Grundbuch!D76","v":0}]
["13.","2880",null,null,{"$f":"Grundbuch!D99","v":0}]
["17.","2800",null,null,{"$f":"Grundbuch!D129","v":0}]
[null,null,null,null,{"$f":"SUM(E67:E73)","v":0},null,null,null,null,{"$f":"E74","v":0}]
[]
["Soll","2800 Kreditinstitute/Bank",null,null,null,null,null,null,null,"Haben"]
["AB","8000",null,null,{"$f":"Bilanzbuch!C14","v":75000},"1.","4800",null,null,{"$f":"Grundbuch!G10","v":0}]
["4.","2400",null,null,{"$f":"Grundbuch!D32","v":0},"11.","4400",null,null,{"$f":"Grundbuch!G83","v":0}]
["20.","2400",null,null,{"$f":"Grundbuch!D150","v":0},"17.","6870","2600",null,{"$f":"Grundbuch!G128","v":0}]
[null,null,null,null,null,"SB","8010",null,null,{"$f":"J81-J77-J78-J79","v":75000}]
[null,null,null,null,{"$f":"SUM(E77:E80)","v":75000},null,null,null,null,{"$f":"E81","v":75000}]
[]
["Soll","2880 Kasse",null,null,null,null,null,null,null,"Haben"]
["AB","8000",null,null,{"$f":"Bilanzbuch!C15","v":9200},"3.","6160","2600",null,{"$f":"Grundbuch!G24","v":0}]
["16.","0840","4800",null,{"$f":"Grundbuch!D121","v":0},"5.","2001","2600",null,{"$f":"Grundbuch!G40","v":0}]
[null,null,null,null,null,"10.","6140","2600",null,{"$f":"Grundbuch!G75","v":0}]
[null,null,null,null,null,"13.","6870","2600",null,{"$f":"Grundbuch!G98","v":0}]
[null,null,null,null,null,"SB","8010",null,null,{"$f":"J89-SUM(J84:J87)","v":9200}]
[null,null,null,null,{"$f":"SUM(E84:E88)","v":9200},null,null,null,null,{"$f":"E89","v":9200}]
[]
["Soll","3000 Eigenkapital",null,null,null,null,null,null,null,"Haben"]
["A",8020,null,null,{"$f":"IF(GuV!F12>0,GuV!F12,0)","v":70000},"AB",8000,null,null,{"$f":"Bilanzbuch!F4","v":1213000}]
["SB",8010,null,null,{"$f":"E94-E92","v":1143000},"A",8020,null,null,{"$f":"IF(GuV!C12>0,GuV!C12,0)","v":0}]
[null,null,null,null,{"$f":"J94","v":1213000},null,null,null,null,{"$f":"SUM(J92:J93)","v":1213000}]
[]
["Soll","4200 Verbindlichkeiten gegenüber Kreditinstituten (Darlehen)",null,null,null,null,null,null,null,"Haben"]
["SB","8010",null,null,{"$f":"J97","v":760000},"AB","8000",null,null,{"$f":"Bilanzbuch!F5","v":760000}]
[]
["Soll","4400 Verbindlichkeiten aus Lieferungen und Leistungen",null,null,null,null,null,null,null,"Haben"]
["6.","2000","2600",null,{"$f":"Grundbuch!D47","v":0},"AB","8000",null,null,{"$f":"Bilanzbuch!F6","v":46000}]
["11.","2800","2002","2600",{"$f":"Grundbuch!D83","v":0},"2.","2000","2600",null,{"$f":"Grundbuch!G17","v":0}]
["12.","2002","2600",null,{"$f":"Grundbuch!D91","v":0},"7.","0840","2600",null,{"$f":"Grundbuch!G54","v":0}]
["SB","8010",null,null,{"$f":"E104-SUM(E100:E102)","v":46000}]
[null,null,null,null,{"$f":"J104","v":46000},null,null,null,null,{"$f":"SUM(J100:J103)","v":46000}]
[]
["Soll","4800 Umsatzsteuer",null,null,null,null,null,null,null,"Haben"]
["1.","2800",null,null,{"$f":"Grundbuch!D10","v":0},"AB","8000",null,null,{"$f":"Bilanzbuch!F7","v":10400}]
["4.","2400",null,null,{"$f":"Grundbuch!D34","v":0},"9.","2400",null,null,{"$f":"Grundbuch!G69","v":0}]
["8.","2400",null,null,{"$f":"Grundbuch!D62","v":0},"15.","2400",null,null,{"$f":"Grundbuch!G115","v":0}]
["19.","2400",null,null,{"$f":"Grundbuch!D143","v":0},"16.","2880",null,null,{"$f":"Grundbuch!G122","v":0}]
["20.",2400,null,null,{"$f":"Grundbuch!D152","v":0},"18.","2400",null,null,{"$f":"Grundbuch!G136","v":0}]
["A.","2600",null,null,{"$f":"J70","v":0}]
["SB",8010,null,null,{"$f":"E114-SUM(E107:E112)","v":10400}]
[null,null,null,null,{"$f":"J114","v":10400},null,null,null,null,{"$f":"SUM(J107:J113)","v":10400}]
[]
["Soll","5000 Umsatzerlöse",null,null,null,null,null,null,null,"Haben"]
["19.","2400",null,null,{"$f":"Grundbuch!D142","v":0},"9.","2400",null,null,{"$f":"Grundbuch!G68","v":0}]
["A","5001",null,null,{"$f":"J123","v":0},"15.","2400",null,null,{"$f":"Grundbuch!G114","v":0}]
["A",8020,null,null,{"$f":"E120-E118-E117","v":0},"15.","2400",null,null,{"$f":"Grundbuch!G135","v":0}]
[null,null,null,null,{"$f":"J120","v":0},null,null,null,null,{"$f":"SUM(J117:J119)","v":0}]
[]
["Soll","5001 Erlösberichtigungen",null,null,null,null,null,null,null,"Haben"]
["4.","2400",null,null,{"$f":"Grundbuch!D33","v":0},"A","5000",null,null,{"$f":"J126","v":0}]
["8.","2400",null,null,{"$f":"Grundbuch!D61","v":0}]
["20.","2400",null,null,{"$f":"Grundbuch!D151","v":0}]
[null,null,null,null,{"$f":"SUM(E123:E125)","v":0},null,null,null,null,{"$f":"E126","v":0}]
[]
["Soll","5200 Bestandsveränderunen",null,null,null,null,null,null,null,"Haben"]
[{"$f":"IF(J49<E49,\"A\",\"\")","v":"A"},{"$f":"IF(J49<E49,2100,\"\")","v":2100},null,null,{"$f":"IF(J49<E49,J50,0)","v":24000},{"$f":"IF(E49<J49,\"A\",\"\")","v":""},{"$f":"IF(E49<J49,2100,\"\")","v":""},null,null,{"$f":"IF(E49<J49,E50,0)","v":0}]
[{"$f":"IF(J54<E54,\"A\",\"\")","v":"A"},{"$f":"IF(J54<E54,2200,\"\")","v":2200},null,null,{"$f":"IF(J54<E54,J55,0)","v":46000},{"$f":"IF(E54<J54,\"A\",\"\")","v":""},{"$f":"IF(E54<J54,2200,\"\")","v":""},null,null,{"$f":"IF(E54<J54,E55,0)","v":0}]
[{"$f":"IF(($J$129+$J$130)>($E$129+$E$130),\"A\",\"\")","v":""},{"$f":"IF(($J$129+$J$130)>($E$129+$E$130),\"8020\",\"\")","v":""},null,null,{"$f":"IF(($J$129+$J$130)>($E$129+$E$130),($J$129+$J$130)-(E129+E130),0)","v":0},{"$f":"IF(($J$129+$J$130)<($E$129+$E$130),\"A\",\"\")","v":"A"},{"$f":"IF(($J$129+$J$130)<($E$129+$E$130),\"8020\",\"\")","v":"8020"},null,null,{"$f":"IF(($J$129+$J$130)<($E$129+$E$130),($E$129+$E$130)-(J129+J130),0)","v":70000}]
[null,null,null,null,{"$f":"IF(($J$129+$J$130)>($E$129+$E$130),($J$129+$J$130),($E$129+$E$130))","v":70000},null,null,null,null,{"$f":"IF(($J$129+$J$130)>($E$129+$E$130),($J$129+$J$130),($E$129+$E$130))","v":70000}]
[]
["Soll","6000 Aufwendungen für Rohstoffe",null,null,null,null,null,null,null,"Haben"]
["14.","2000",null,null,{"$f":"Grundbuch!D106","v":0},"A",8020,null,null,{"$f":"E135","v":0}]
[]
["Soll","6020 Aufwendungen für Hilfsstoffe",null,null,null,null,null,null,null,"Haben"]
["14.","2020",null,null,{"$f":"Grundbuch!D107","v":0},"A",8020,null,null,{"$f":"E138","v":0}]
[]
["Soll","6030 Aufwendungen für Betriebsstoffe",null,null,null,null,null,null,null,"Haben"]
["14.","2030",null,null,{"$f":"Grundbuch!D108","v":0},"A",8020,null,null,{"$f":"E141","v":0}]
[]
["Soll","6140 Frachten und Femdlager",null,null,null,null,null,null,null,"Haben"]
["10.","2880",null,null,{"$f":"Grundbuch!D75","v":0},"A",8020,null,null,{"$f":"E144","v":0}]
[]
["Soll","6160 Fremdinstandhaltung",null,null,null,null,null,null,null,"Haben"]
["3.","2880",null,null,{"$f":"Grundbuch!D24","v":0},"A",8020,null,null,{"$f":"E147","v":0}]
[]
[]
["Soll","6520 Abschreibungen auf Sachanlagen",null,null,null,null,null,null,null,"Haben"]
["A2","0700",null,null,{"$f":"Grundbuch!D166","v":0},"A","8020",null,null,{"$f":"J154","v":0}]
["A2","0800",null,null,{"$f":"Grundbuch!D167","v":0}]
["A2","0840",null,null,{"$f":"Grundbuch!D168","v":0}]
[null,null,null,null,{"$f":"SUM(E151:E153)","v":0},null,null,null,null,{"$f":"E154","v":0}]
[]
["Soll","6870 Werbung",null,null,null,null,null,null,null,"Haben"]
["13.","2880",null,null,{"$f":"Grundbuch!D98","v":0},"A",8020,null,null,{"$f":"J159","v":0}]
["17.","2800",null,null,{"$f":"Grundbuch!D128","v":0}]
[null,null,null,null,{"$f":"SUM(E157:E158)","v":0},null,null,null,null,{"$f":"E159","v":0}]

{"sheet":"GuV","index":3,"n_rows":13,"n_cols":6,"rows_kept":13,"cut":false,"hidden":false,"merged":[[0,0,0,5],[2,1,2,4]]}
["Gewinn- und Verlustrechnung"]
[]
["Soll","8020 Gewinn und Verlust",null,null,null,"Haben"]
["5200",{"$f":"VLOOKUP(A4,Kontenplan!$A$4:$B$35,2)","v":"Bestandsveränderungen"},{"$f":"IF(Hauptbuch!J131>0,Hauptbuch!J131,0)","v":70000},"5000",{"$f":"VLOOKUP(D4,Kontenplan!$A$4:$B$35,2)","v":"Umsatzerlöse"},{"$f":"Hauptbuch!E119","v":0}]
["6000","Aufwendungen für Rohstoffe",{"$f":"Hauptbuch!J135","v":0},"5200",{"$f":"VLOOKUP(D5,Kontenplan!$A$4:$B$35,2)","v":"Bestandsveränderungen"},{"$f":"IF(Hauptbuch!E131>0,Hauptbuch!E131,0)","v":0}]
["6020","Aufwendungen für Hilfsstoffe",{"$f":"Hauptbuch!J138","v":0}]
["6030","Aufwendungen für Betriebsstoffe",{"$f":"Hauptbuch!J141","v":0}]
["6140","Frachten und Fremdlager",{"$f":"Hauptbuch!J144","v":0}]
["6160","Fremdinstandhaltung",{"$f":"Hauptbuch!J147","v":0}]
["6520","Abschreibungen auf Sachanlagen",{"$f":"Hauptbuch!J151","v":0}]
["6870","Werbung",{"$f":"Hauptbuch!J157","v":0}]
[{"$f":"IF(SUM($F$4:$F$11)>SUM($C$4:$C$11),\"3000\",\"\")","v":""},{"$f":"IF(SUM($F$4:$F$11)>SUM($C$4:$C$11),\"Eigenkapital\",\"\")","v":""},{"$f":"IF(SUM($F$4:$F$11)>SUM($C$4:$C$11),SUM($F$4:$F$11)-SUM($C$4:$C$11),0)","v":0},{"$f":"IF(SUM($F$4:$F$11)>SUM($C$4:$C$11),\"\",\"3000\")","v":"3000"},{"$f":"IF(SUM($F$4:$F$11)>SUM($C$4:$C$11),\"\",\"Eigenkapital\")","v":"Eigenkapital"},{"$f":"IF(SUM($C$4:$C$11)>SUM($F$4:$F$7),SUM($C$4:$C$11)-SUM($F$4:$F$7),0)","v":70000}]
[null,null,{"$f":"IF(SUM($F$4:$F$11)>SUM($C$4:$C$11),SUM($F$4:$F$11),SUM($C$4:$C$11))","v":70000},null,null,{"$f":"SUM(F4:F12)","v":70000}]

{"sheet":"Bilanzbuch","index":4,"n_rows":31,"n_cols":6,"rows_kept":31,"cut":false,"hidden":false,"merged":[[2,1,2,4],[0,0,0,5],[17,1,17,4]]}
["Bilanzbuch"]
[]
["Aktiva","8000 Eröffnungsbilanz",null,null,null,"Passiva"]
["0500",{"$f":"VLOOKUP(A4,Kontenplan!$A$4:$B$35,2)","v":"Grundstücke und Bauten"},880000,"3000",{"$f":"VLOOKUP(D4,Kontenplan!$A$4:$B$35,2)","v":"Eigenkapital"},{"$f":"F16-SUM(F5:F15)","v":1213000}]
["0700",{"$f":"VLOOKUP(A5,Kontenplan!$A$4:$B$35,2)","v":"Technische Anlagen und Maschinen"},545000,"4200","Verbindlichkeiten g. Kreditinstitute",760000]
["0800",{"$f":"VLOOKUP(A6,Kontenplan!$A$4:$B$35,2)","v":"Beriebs- und Geschäftsausstattung"},125000,"4400",{"$f":"VLOOKUP(D6,Kontenplan!$A$4:$B$35,2)","v":"Verbindlichkeiten a.L.u.L."},46000]
["0840","Fuhrpark",110000,"4800",{"$f":"VLOOKUP(D7,Kontenplan!$A$4:$B$35,2)","v":"Umsatzsteuer"},10400]
["2000",{"$f":"VLOOKUP(A8,Kontenplan!$A$4:$B$35,2)","v":"Rohstoffe"},98000]
["2020",{"$f":"VLOOKUP(A9,Kontenplan!$A$4:$B$35,2)","v":"Hilfsstoffe"},24000]
["2030",{"$f":"VLOOKUP(A10,Kontenplan!$A$4:$B$35,2)","v":"Betriebsstoffe"},9200]
["2100",{"$f":"VLOOKUP(A11,Kontenplan!$A$4:$B$35,2)","v":"Unfertige Erzeugnisse"},24000]
["2200",{"$f":"VLOOKUP(A12,Kontenplan!$A$4:$B$35,2)","v":"Fertige Erzeugnisse"},46000]
["2400",{"$f":"VLOOKUP(A13,Kontenplan!$A$4:$B$35,2)","v":"Forderungen a.L.u.L."},84000]
["2800",{"$f":"VLOOKUP(A14,Kontenplan!$A$4:$B$35,2)","v":"Kreditinstitute/Bank"},75000]
["2880",{"$f":"VLOOKUP(A15,Kontenplan!$A$4:$B$35,2)","v":"Kasse"},9200]
[null,null,{"$f":"SUM(C4:C15)","v":2029400},null,null,{"$f":"C16","v":2029400}]
[]
["Aktiva","8010 Schlussbilanz",null,null,null,"Passiva"]
["0500",{"$f":"VLOOKUP(A19,Kontenplan!$A$4:$B$35,2)","v":"Grundstücke und Bauten"},{"$f":"Hauptbuch!J4","v":880000},"3000",{"$f":"VLOOKUP(D19,Kontenplan!$A$4:$B$35,2)","v":"Eigenkapital"},{"$f":"Hauptbuch!E93","v":1143000}]
["0700",{"$f":"VLOOKUP(A20,Kontenplan!$A$4:$B$35,2)","v":"Technische Anlagen und Maschinen"},{"$f":"Hauptbuch!J8","v":545000},"4200","Verbindlichkeiten g. Kreditinstitute",{"$f":"Hauptbuch!E97","v":760000}]
["0800",{"$f":"VLOOKUP(A21,Kontenplan!$A$4:$B$35,2)","v":"Beriebs- und Geschäftsausstattung"},{"$f":"Hauptbuch!J13","v":125000},"4400",{"$f":"VLOOKUP(D21,Kontenplan!$A$4:$B$35,2)","v":"Verbindlichkeiten a.L.u.L."},{"$f":"Hauptbuch!E103","v":46000}]
["0840","Fuhrpark",{"$f":"Hauptbuch!J19","v":110000},"4800",{"$f":"VLOOKUP(D22,Kontenplan!$A$4:$B$35,2)","v":"Umsatzsteuer"},{"$f":"Hauptbuch!E113","v":10400}]
["2000",{"$f":"VLOOKUP(A23,Kontenplan!$A$4:$B$35,2)","v":"Rohstoffe"},{"$f":"Hauptbuch!J26","v":98000}]
["2020",{"$f":"VLOOKUP(A24,Kontenplan!$A$4:$B$35,2)","v":"Hilfsstoffe"},{"$f":"Hauptbuch!J39","v":24000}]
["2030",{"$f":"VLOOKUP(A25,Kontenplan!$A$4:$B$35,2)","v":"Betriebsstoffe"},{"$f":"Hauptbuch!J45","v":9200}]
["2100",{"$f":"VLOOKUP(A26,Kontenplan!$A$4:$B$35,2)","v":"Unfertige Erzeugnisse"},{"$f":"Grundbuch!D159","v":0}]
["2200",{"$f":"VLOOKUP(A27,Kontenplan!$A$4:$B$35,2)","v":"Fertige Erzeugnisse"},{"$f":"Grundbuch!D160","v":0}]
["2400",{"$f":"VLOOKUP(A28,Kontenplan!$A$4:$B$35,2)","v":"Forderungen a.L.u.L."},{"$f":"Hauptbuch!J63","v":84000}]
["2800",{"$f":"VLOOKUP(A29,Kontenplan!$A$4:$B$35,2)","v":"Kreditinstitute/Bank"},{"$f":"Hauptbuch!J80","v":75000}]
["2880",{"$f":"VLOOKUP(A30,Kontenplan!$A$4:$B$35,2)","v":"Kasse"},{"$f":"Hauptbuch!J88","v":9200}]
[null,null,{"$f":"SUM(C19:C30)","v":1959400},null,null,{"$f":"SUM(F19:F30)","v":1959400}]

{"sheet":"Kontenplan","index":5,"n_rows":35,"n_cols":2,"rows_kept":35,"cut":false,"hidden":false,"merged":[]}
[null,"Kontenplan"]
[]
["Nr.","Konto"]
["0500","Grundstücke und Bauten"]
["0700","Technische Anlagen und Maschinen"]
["0800","Beriebs- und Geschäftsausstattung"]
["0840","Fuhrpark"]
["2000","Rohstoffe"]
["2001","Bezugskosten (Rohstoffe)"]
["2002","Nachlässe (Rohstoffe)"]
["2020","Hilfsstoffe"]
["2030","Betriebsstoffe"]
["2100","Unfertige Erzeugnisse"]
["2200","Fertige Erzeugnisse"]
["2400","Forderungen a.L.u.L."]
["2600","Vorsteuer"]
["2800","Kreditinstitute/Bank"]
["2880","Kasse"]
["3000","Eigenkapital"]
["4200","Verbindlichkeiten g. Kreditinstitute"]
["4400","Verbindlichkeiten a.L.u.L."]
["4800","Umsatzsteuer"]
["5000","Umsatzerlöse"]
["5001","Erlösberichtigungen"]
["5200","Bestandsveränderungen"]
["6000","Aufwendungen für Rohstoffe"]
["6020","Aufwendungen für Hilfsstoffe"]
["6030","Aufwendungen für Betriebsstoffe"]
["6140","Frachten und Fremdlager"]
["6160","Fremdinstandhaltung"]
["6520","Abschreibungen auf Sachanlagen"]
["6870","Werbung"]
["8000","Eröffnungsbilanz"]
["8010","Schlussbilanz"]
["8020","Gewinn und Verlust"]