{"text_format":"1","workbook":"xlsx","n_sheets":6,"sheets":["Hinweise","Grundbuch","Hauptbuch","GuV","Bilanzbuch","Kontenplan"],"not_rendered":{"charts":0,"images":26,"macros":1,"external_links":0,"defined_names":0,"comments":0,"pivot_tables":0},"unopened":[],"bounds":{"document_bytes":16777216,"sheet_cells":100000,"rows_first":2000,"rows_last":500,"rows_between":2000,"halvings":0,"cell_chars":16384,"cell_head_chars":4096},"cells_cut":0,"cells_raw":0,"read":"whole","date_system":"1900"}

{"sheet":"Hinweise","index":0,"n_rows":28,"n_cols":1,"rows_kept":28,"cut":false,"hidden":false,"merged":[[0,0,0,7],[2,0,2,1],[4,0,9,3]]}
["Geschäftsgang 18"]
[]
["Voraussetzungen"]
["Um den Geschäftsgang buchen zu können müssen Sie Kenntnisse über die folgenden Lehrninhalte haben:"]
["Buchungen auf Bestandskonten, Buchungen auf Erfolgskonten, Bestandsveränderungen, Abschreibungen, Umsatzsteuer, Buchung von Bezugskosten, Buchung von Nachlässen und Erlösberichtigungen"]
[]
[]
[]
[]
[]
[]
["Vorgehensweise"]
["1. Wählen Sie die Tabelle \"Grundbuch\"."]
[]
["2. Buchen Sie die Geschäftsvorfälle"]
["    entweder durch Direkteingabe in die entsprechenden Felder des Grundbuchs (Kontennummern und Beträge)"]
["    oder durch Aufruf von Buchungsfenstern. (Klicken Sie dazu jeweils auf die Schaltfläche \"Buchung\" und beenden"]
["    Sie die Eingabe  mit \"OK\".)"]
["    Die Kontennummern sind vierstellig anzugeben. (siehe Kontenplan). Bei zusammengesetzten Buchungssätzen"]
["    sind die Buchungen nach der Höhe der Beträge geordnet vorzunehmen. "]
[]
["3. Sie können sich den Kontenplan mit Kontennummern jederzeit durch Klick auf den"]
["    entsprechenden Button anzeigen lassen."]
[]
["4. Die Richtigkeit Ihrer Buchungen wird bestätigt oder Sie werden auf"]
["    Fehler hingewiesen. (Ohne Buchung werden Fehler angezeigt.)"]
[]
["5. Hauptbuch, Gewinn und Verlust und Bilanzbuch werden automatisch erstellt. "]

{"sheet":"Grundbuch","index":1,"n_rows":170,"n_cols":7,"rows_kept":170,"cut":false,"hidden":false,"merged":[[9,4,10,4],[139,5,139,6],[9,6,10,6],[149,0,151,0],[5,5,5,6],[6,5,6,6],[7,5,7,6],[9,0,10,0],[9,1,10,1],[9,2,10,2],[9,3,10,3],[125,5,125,6],[9,5,10,5],[141,0,142,0],[144,1,147,2],[144,5,145,6],[146,5,146,6],[147,5,147,6],[137,1,139,2],[137,5,137,6],[138,5,138,6],[156,5,156,6],[165,0,167,0],[116,1,118,2],[116,5,116,6],[117,5,117,6],[118,5,118,6],[120,0,121,0],[123,1,125,2],[123,5,123,6],[124,5,124,6],[111,5,111,6],[113,0,114,0],[161,5,161,6],[162,5,162,6],[163,5,163,6],[127,0,128,0],[130,1,132,2],[130,5,130,6],[131,5,131,6],[132,5,132,6],[100,5,101,6],[102,5,102,6],[103,5,103,6],[105,0,107,0],[109,5,109,6],[110,5,110,6],[36,5,36,6],[37,5,37,6],[31,0,33,0],[23,0,24,0],[26,1,29,2],[26,5,27,6],[28,5,28,6],[29,5,29,6],[50,5,50,6],[51,5,51,6],[58,5,58,6],[16,0,17,0],[35,1,37,2],[19,5,19,6],[20,5,20,6],[21,5,21,6],[19,1,21,2],[35,5,35,6],[80,5,80,6],[74,0,75,0],[70,1,72,2],[71,5,71,6],[72,5,72,6],[12,1,14,2],[12,5,12,6],[13,5,13,6],[14,5,14,6],[49,5,49,6],[46,0,47,0],[56,1,58,2],[70,5,70,6],[169,0,169,6],[1,0,1,4],[2,0,2,4],[67,0,68,0],[77,1,80,2],[77,5,78,6],[79,5,79,6],[49,1,51,2],[56,5,56,6],[57,5,57,6],[154,5,154,6],[155,5,155,6],[39,0,40,0],[42,1,44,2],[42,5,42,6],[43,5,43,6],[44,5,44,6],[60,0,61,0],[63,1,65,2],[63,5,63,6],[64,5,64,6],[65,5,65,6],[53,0,54,0],[93,5,93,6],[97,0,98,0],[94,5,94,6],[95,5,95,6],[82,0,84,0],[86,1,88,2],[86,5,86,6],[87,5,87,6],[88,5,88,6],[161,1,161,3],[162,1,162,3],[163,1,163,3],[90,0,91,0],[93,1,95,2],[153,0,153,2],[109,1,111,2],[158,0,159,0],[134,0,135,0]]}
[]
["Geschäftsvorfälle"]
["Grundbuch"]
[null,null,null,null,null,null,0.19]
[]
["1.","Banküberweisung der Umsatzsteuer-Zahllast,",null,null,{"$f":"Bilanzbuch!F7","v":10400},{"$f":"IF(AND(B10=\"4800\",E10=\"2800\"),\"Die Konten sind richtig!\",\"Mindestens ein Konto ist falsch!\")","v":"Mindestens ein Konto ist falsch!"}]
["Geschäftsvorfall",null,null,null,null,{"$f":"IF(AND(D10=E6,G10=E6),\"Die Beträge sind richtig!\",\"Mindestens ein Betrag ist falsch!\")","v":"Mindestens ein Betrag ist falsch!"}]
[null,null,null,null,null,{"$f":"IF(AND(F6=\"Die Konten sind richtig!\",F7=\"Die Beträge sind richtig!\"),\"Alles richtig!\",\"Es sind noch Fehler vorhanden!\")","v":"Es sind noch Fehler vorhanden!"}]
[null,"Soll","Konto","€","Haben","Konto","€"]
["Buchungssatz","",{"$f":"IF(B10=\"\",\"\",VLOOKUP(B10,Kontenplan!$A$4:$B$35,2))","v":""},null,"",{"$f":"IF(E10=\"\",\"\",VLOOKUP(E10,Kontenplan!$A$4:$B$35,2))","v":""}]
[]
[]
["2.","Zieleinkauf von Baumwollstoffen bei der Baumwollweberei Kaiser OHG, ",null,"netto",21300,{"$f":"IF(AND(B17=\"2000\",B18=\"2600\",E17=\"4400\"),\"Die Konten sind richtig!\",\"Mindestens ein Konto ist falsch!\")","v":"Mindestens ein Konto ist falsch!"}]
["Geschäftsvorfall",null,null,"USt.",{"$f":"E13*$G$4","v":4047},{"$f":"IF(AND(D17=E13,D18=E14,G17=E15),\"Die Beträge sind richtig!\",\"Mindestens ein Betrag ist falsch!\")","v":"Mindestens ein Betrag ist falsch!"}]
[null,null,null,"brutto",{"$f":"SUM(E13:E14)","v":25347},{"$f":"IF(AND(F13=\"Die Konten sind richtig!\",F14=\"Die Beträge sind richtig!\"),\"Alles richtig!\",\"Es sind noch Fehler vorhanden!\")","v":"Es sind noch Fehler vorhanden!"}]
[null,"Soll","Konto","€","Haben","Konto","€"]
["Buchungssatz","",{"$f":"IF(B17=\"\",\"\",VLOOKUP(B17,Kontenplan!$A$4:$B$35,2))","v":""},null,"",{"$f":"IF(E17=\"\",\"\",VLOOKUP(E17,Kontenplan!$A$4:$B$35,2))","v":""}]
[null,"",{"$f":"IF(B18=\"\",\"\",VLOOKUP(B18,Kontenplan!$A$4:$B$35,2))","v":""},null,null,{"$f":"IF(E18=\"\",\"\",VLOOKUP(E18,Kontenplan!$A$4:$B$35,2))","v":""}]
[]
["3.","Barzahlung für Installationsarbeiten am Computernetzwerk der Tropic GmbH,",null,"netto",450,{"$f":"IF(AND(B24=\"6160\",B25=\"2600\",E24=\"2880\"),\"Die Konten sind richtig!\",\"Mindestens ein Konto ist falsch!\")","v":"Mindestens ein Konto ist falsch!"}]
["Geschäftsvorfall",null,null,"USt.",{"$f":"E20*$G$4","v":85.5},{"$f":"IF(AND(D24=E20,D25=E21,G24=E22),\"Die Beträge sind richtig!\",\"Mindestens ein Betrag ist falsch!\")","v":"Mindestens ein Betrag ist falsch!"}]
[null,null,null,"brutto",{"$f":"SUM(E20:E21)","v":535.5},{"$f":"IF(AND(F20=\"Die Konten sind richtig!\",F21=\"Die Beträge sind richtig!\"),\"Alles richtig!\",\"Es sind noch Fehler vorhanden!\")","v":"Es sind noch Fehler vorhanden!"}]
[null,"Soll","Konto","€","Haben","Konto","€"]
["Buchungssatz","",{"$f":"IF(B24=\"\",\"\",VLOOKUP(B24,Kontenplan!$A$4:$B$35,2))","v":""},null,"",{"$f":"IF(E24=\"\",\"\",VLOOKUP(E24,Kontenplan!$A$4:$B$35,2))","v":""}]
[null,"",{"$f":"IF(B25=\"\",\"\",VLOOKUP(B25,Kontenplan!$A$4:$B$35,2))","v":""},null,null,{"$f":"IF(E25=\"\",\"\",VLOOKUP(E25,Kontenplan!$A$4:$B$35,2))","v":""}]
[]
["4.","Die Boutique Marinas Collection GmbH begleicht eine Ausgangsrechnung abzüglich 3% Skonto durch Banküberweisung, ",null,"Gutschrift",{"$f":"E30-E29-E28","v":23086},{"$f":"IF(AND(B32=\"2800\",B33=\"5001\",B34=\"4800\",E32=\"2400\"),\"Die Konten sind richtig!\",\"Mindestens ein Konto ist falsch!\")","v":"Mindestens ein Konto ist falsch!"}]
[null,null,null,"Skonto",{"$f":"ROUND((E30*3%)-((E30*3%)/(100+($G$4*100))*($G$4*100)),2)","v":600}]
["Geschäftsvorfall",null,null,"USt.",{"$f":"ROUND(E28*$G$4,2)","v":114},{"$f":"IF(AND(D32=E27,D33=E28,D34=E29,G32=E30),\"Die Beträge sind richtig!\",\"Mindestens ein Betrag ist falsch!\")","v":"Mindestens ein Betrag ist falsch!"}]
[null,null,null,"Bruttobetrag",23800,{"$f":"IF(AND(F27=\"Die Konten sind richtig!\",F29=\"Die Beträge sind richtig!\"),\"Alles richtig!\",\"Es sind noch Fehler vorhanden!\")","v":"Es sind noch Fehler vorhanden!"}]
[null,"Soll","Konto","€","Haben","Konto","€"]
["Buchungssatz","",{"$f":"IF(B32=\"\",\"\",VLOOKUP(B32,Kontenplan!$A$4:$B$35,2))","v":""},null,"",{"$f":"IF(E32=\"\",\"\",VLOOKUP(E32,Kontenplan!$A$4:$B$35,2))","v":""}]
[null,"",{"$f":"IF(B33=\"\",\"\",VLOOKUP(B33,Kontenplan!$A$4:$B$35,2))","v":""},null,null,{"$f":"IF(E33=\"\",\"\",VLOOKUP(E33,Kontenplan!$A$4:$B$35,2))","v":""}]
[null,"",{"$f":"IF(B34=\"\",\"\",VLOOKUP(B34,Kontenplan!$A$4:$B$35,2))","v":""},null,null,{"$f":"IF(E34=\"\",\"\",VLOOKUP(E34,Kontenplan!$A$4:$B$35,2))","v":""}]
[]
["5.","Bezugskosten für den Einkauf aus Geschäftsvorfall 2 bar,",null,"netto",870,{"$f":"IF(AND(B40=\"2001\",B41=\"2600\",E40=\"2880\"),\"Die Konten sind richtig!\",\"Mindestens ein Konto ist falsch!\")","v":"Mindestens ein Konto ist falsch!"}]
["Geschäftsvorfall",null,null,"USt.",{"$f":"E36*$G$4","v":165.3},{"$f":"IF(AND(D40=E36,D41=E37,G40=E38),\"Die Beträge sind richtig!\",\"Mindestens ein Betrag ist falsch!\")","v":"Mindestens ein Betrag ist falsch!"}]
[null,null,null,"brutto",{"$f":"SUM(E36:E37)","v":1035.3},{"$f":"IF(AND(F36=\"Die Konten sind richtig!\",F37=\"Die Beträge sind richtig!\"),\"Alles richtig!\",\"Es sind noch Fehler vorhanden!\")","v":"Es sind noch Fehler vorhanden!"}]
[null,"Soll","Konto","€","Haben","Konto","€"]
["Buchungssatz","",{"$f":"IF(B40=\"\",\"\",VLOOKUP(B40,Kontenplan!$A$4:$B$35,2))","v":""},null,"",{"$f":"IF(E40=\"\",\"\",VLOOKUP(E40,Kontenplan!$A$4:$B$35,2))","v":""}]
[null,"",{"$f":"IF(B41=\"\",\"\",VLOOKUP(B41,Kontenplan!$A$4:$B$35,2))","v":""},null,null,{"$f":"IF(E41=\"\",\"\",VLOOKUP(E41,Kontenplan!$A$4:$B$35,2))","v":""}]
[]
["6.","Rücksendung beschädigter Rohstoffe aus Geschäftsvorfall 2. an Baumwollweberei Kaiser OHG,",null,"netto",1300,{"$f":"IF(AND(B47=\"4400\",E47=\"2000\",E48=\"2600\"),\"Die Konten sind richtig!\",\"Mindestens ein Konto ist falsch!\")","v":"Mindestens ein Konto ist falsch!"}]
["Geschäftsvorfall",null,null,"USt.",{"$f":"E43*$G$4","v":247},{"$f":"IF(AND(D47=E45,G47=E43,G48=E44),\"Die Beträge sind richtig!\",\"Mindestens ein Betrag ist falsch!\")","v":"Mindestens ein Betrag ist falsch!"}]
[null,null,null,"brutto",{"$f":"SUM(E43:E44)","v":1547},{"$f":"IF(AND(F43=\"Die Konten sind richtig!\",F44=\"Die Beträge sind richtig!\"),\"Alles richtig!\",\"Es sind noch Fehler vorhanden!\")","v":"Es sind noch Fehler vorhanden!"}]
[null,"Soll","Konto","€","Haben","Konto","€"]
["Buchungssatz","",{"$f":"IF(B47=\"\",\"\",VLOOKUP(B47,Kontenplan!$A$4:$B$35,2))","v":""},null,"",{"$f":"IF(E47=\"\",\"\",VLOOKUP(E47,Kontenplan!$A$4:$B$35,2))","v":""}]
[null,null,{"$f":"IF(B48=\"\",\"\",VLOOKUP(B48,Kontenplan!$A$4:$B$35,2))","v":""},null,"",{"$f":"IF(E48=\"\",\"\",VLOOKUP(E48,Kontenplan!$A$4:$B$35,2))","v":""}]
[]
["7.","Kauf eines Pkw auf Ziel, Listenpreis 34.000,00 Euro. Wir erhalten einen Treuerabatt von 10%. Zieleinkaufspreis: 30.600,00 Euro",null,"netto",30600,{"$f":"IF(AND(B54=\"0840\",B55=\"2600\",E54=\"4400\"),\"Die Konten sind richtig!\",\"Mindestens ein Konto ist falsch!\")","v":"Mindestens ein Konto ist falsch!"}]
["Geschäftsvorfall",null,null,"USt.",{"$f":"E50*$G$4","v":5814},{"$f":"IF(AND(D54=E50,D55=E51,G54=E52),\"Die Beträge sind richtig!\",\"Mindestens ein Betrag ist falsch!\")","v":"Mindestens ein Betrag ist falsch!"}]
[null,null,null,"brutto",{"$f":"SUM(E50:E51)","v":36414},{"$f":"IF(AND(F50=\"Die Konten sind richtig!\",F51=\"Die Beträge sind richtig!\"),\"Alles richtig!\",\"Es sind noch Fehler vorhanden!\")","v":"Es sind noch Fehler vorhanden!"}]
[null,"Soll","Konto","€","Haben","Konto","€"]
["Buchungssatz","",{"$f":"IF(B54=\"\",\"\",VLOOKUP(B54,Kontenplan!$A$4:$B$35,2))","v":""},null,"",{"$f":"IF(E54=\"\",\"\",VLOOKUP(E54,Kontenplan!$A$4:$B$35,2))","v":""}]
[null,"",{"$f":"IF(B55=\"\",\"\",VLOOKUP(B55,Kontenplan!$A$4:$B$35,2))","v":""},null,null,{"$f":"IF(E55=\"\",\"\",VLOOKUP(E55,Kontenplan!$A$4:$B$35,2))","v":""}]
[]
["8.","Wir gewähren der Boutique Marinas Collection GmbH einen Bonus,",null,"netto",450,{"$f":"IF(AND(B61=\"5001\",B62=\"4800\",E61=\"2400\"),\"Die Konten sind richtig!\",\"Mindestens ein Konto ist falsch!\")","v":"Mindestens ein Konto ist falsch!"}]
["Geschäftsvorfall",null,null,"USt.",{"$f":"E57*$G$4","v":85.5},{"$f":"IF(AND(D61=E57,D62=E58,G61=E59),\"Die Beträge sind richtig!\",\"Mindestens ein Betrag ist falsch!\")","v":"Mindestens ein Betrag ist falsch!"}]
[null,null,null,"brutto",{"$f":"SUM(E57:E58)","v":535.5},{"$f":"IF(AND(F57=\"Die Konten sind richtig!\",F58=\"Die Beträge sind richtig!\"),\"Alles richtig!\",\"Es sind noch Fehler vorhanden!\")","v":"Es sind noch Fehler vorhanden!"}]
[null,"Soll","Konto","€","Haben","Konto","€"]
{"$rows_left_out":111}
{"sheet":"Hauptbuch","index":2,"n_rows":159,"n_cols":10,"rows_kept":159,"cut":false,"hidden":false,"merged":[[155,1,155,8],[52,1,52,8],[145,1,145,8],[121,1,121,8],[127,1,127,8],[133,1,133,8],[136,1,136,8],[139,1,139,8],[75,1,75,8],[115,1,115,8],[142,1,142,8],[149,1,149,8],[57,1,57,8],[95,1,95,8],[82,1,82,8],[90,1,90,8],[65,1,65,8],[105,1,105,8],[0,0,0,9],[2,1,2,8],[5,1,5,8],[10,1,10,8],[15,1,15,8],[21,1,21,8],[98,1,98,8],[47,1,47,8],[28,1,28,8],[31,1,31,8],[42,1,42,8],[36,1,36,8]]}
["Hauptbuch"]
[]
["Soll","0500 Grundstücke und Bauten",null,null,null,null,null,null,null,"Haben"]
["AB","8000",null,null,{"$f":"Bilanzbuch!C4","v":880000},"SB",8010,null,null,{"$f":"E4","v":880000}]
[]
["Soll","0700 Technische Anlagen und Maschinen",null,null,null,null,null,null,null,"Haben"]
["AB","8000",null,null,{"$f":"Bilanzbuch!C5","v":545000},"A2","6520",null,null,{"$f":"Grundbuch!G166","v":0}]
[null,null,null,null,null,"SB","8010",null,null,{"$f":"J9-J7","v":545000}]
[null,null,null,null,{"$f":"SUM(E7:E8)","v":545000},null,null,null,null,{"$f":"E9","v":545000}]
[]
["Soll","0800 Betriebs- und Geschäftsausstattung",null,null,null,null,null,null,null,"Haben"]
["AB","8000",null,null,{"$f":"Bilanzbuch!C6","v":125000},"A2","6520",null,null,{"$f":"Grundbuch!G167","v":0}]
[null,null,null,null,null,"SB","8010",null,null,{"$f":"J14-J12","v":125000}]
[null,null,null,null,{"$f":"SUM(E12:E13)","v":125000},null,null,null,null,{"$f":"E14","v":125000}]
[]
["Soll","0840 Fuhrpark",null,null,null,null,null,null,null,"Haben"]
["AB","8000",null,null,{"$f":"Bilanzbuch!C7","v":110000},"16.","2880",null,null,{"$f":"Grundbuch!G121","v":0}]
["7.","4400",null,null,{"$f":"Grundbuch!D54","v":0},"A2","6520",null,null,{"$f":"Grundbuch!G168","v":0}]
[null,null,null,null,null,"SB","8010",null,null,{"$f":"J20-J17-J18","v":110000}]
[null,null,null,null,{"$f":"SUM(E17:E19)","v":110000},null,null,null,null,{"$f":"E20","v":110000}]
[]
["Soll","2000 Rohstoffe",null,null,null,null,null,null,null,"Haben"]
["AB","8000",null,null,{"$f":"Bilanzbuch!C8","v":98000},"6.","4400",null,null,{"$f":"Grundbuch!G47","v":0}]
["A","2001",null,null,{"$f":"J30","v":0},"14.","6000",null,null,{"$f":"Grundbuch!G106","v":0}]
["2.","4400",null,null,{"$f":"Grundbuch!D17","v":0},"A","2002",null,null,{"$f":"E33","v":0}]
[null,null,null,null,null,"SB",8010,null,null,{"$f":"J27-SUM(J23:J25)","v":98000}]
[null,null,null,null,{"$f":"SUM(E23:E25)","v":98000},null,null,null,null,{"$f":"E27","v":98000}]
[]
["Soll","2001 Bezugskosten (Rohstoffe)",null,null,null,null,null,null,null,"Haben"]
["5.","2880",null,null,{"$f":"Grundbuch!D40","v":0},"A","2000",null,null,{"$f":"E30","v":0}]
[]
["Soll","2002 Nachlässe (Rohstoffe)",null,null,null,null,null,null,null,"Haben"]
["A","2000",null,null,{"$f":"E35","v":0},"11.","4400",null,null,{"$f":"Grundbuch!G84","v":0}]
[null,null,null,null,null,"12.","4400",null,null,{"$f":"Grundbuch!G91","v":0}]
[null,null,null,null,{"$f":"J35","v":0},null,null,null,null,{"$f":"J33+J34","v":0}]
[]
["Soll","2020 Hilfsstoffe",null,null,null,null,null,null,null,"Haben"]
["AB","8000",null,null,{"$f":"Bilanzbuch!C9","v":24000},"14.",6020,null,null,{"$f":"Grundbuch!G107","v":0}]
[null,null,null,null,null,"SB",8010,null,null,{"$f":"J40-J38","v":24000}]
[null,null,null,null,{"$f":"E38","v":24000},null,null,null,null,{"$f":"E40","v":24000}]
[]
[]
["Soll","2030 Betriebsstoffe",null,null,null,null,null,null,null,"Haben"]
["AB","8000",null,null,{"$f":"Bilanzbuch!C10","v":9200},"14.",6030,null,null,{"$f":"Grundbuch!G108","v":0}]
[null,null,null,null,null,"SB",8010,null,null,{"$f":"J46-J44","v":9200}]
[null,null,null,null,{"$f":"SUM(E44:E45)","v":9200},null,null,null,null,{"$f":"E46","v":9200}]
[]
["Soll","2100 Unfertige Erzeugnisse",null,null,null,null,null,null,null,"Haben"]
["AB","8000",null,null,{"$f":"Bilanzbuch!C11","v":24000},"A","8010",null,null,{"$f":"Grundbuch!G159","v":0}]
[{"$f":"IF(E49<J49,\"A\",\"\")","v":""},{"$f":"IF(E49<J49,5200,\"\")","v":""},null,null,{"$f":"IF(E49<J49,E51-E49,\"\")","v":""},{"$f":"IF(E49>J49,\"A\",\"\")","v":"A"},{"$f":"IF(J49<E49,5200,\"\")","v":5200},null,null,{"$f":"IF($E$49>$J$49,J51-J49,\"\")","v":24000}]
[null,null,null,null,{"$f":"IF($E$49>$J$49,$E$49,$J$49)","v":24000},null,null,null,null,{"$f":"IF($E$49>$J$49,$E$49,$J$49)","v":24000}]
[]
["Soll","2200 Fertige Erzeugnisse",null,null,null,null,null,null,null,"Haben"]
["AB","8000",null,null,{"$f":"Bilanzbuch!C12","v":46000},"A","8010",null,null,{"$f":"Grundbuch!G160","v":0}]
[{"$f":"IF(E54<J54,\"A\",\"\")","v":""},{"$f":"IF(E54<J54,5200,\"\")","v":""},null,null,{"$f":"IF(E54<E56,E56-E54,\"\")","v":""},{"$f":"IF(J54<E54,\"A\",\"\")","v":"A"},{"$f":"IF(J54<E54,5200,\"\")","v":5200},null,null,{"$f":"IF(J54<E54,J56-J54,\"\")","v":46000}]
[null,null,null,null,{"$f":"IF(E54>J54,E54,J54)","v":46000},null,null,null,null,{"$f":"IF(E54>J54,E54,J54)","v":46000}]
[]
["Soll","2400 Forderungen aus Lieferungen und Leistungen",null,null,null,null,null,null,null,"Haben"]
["AB","8000",null,null,{"$f":"Bilanzbuch!C13","v":84000},"4.","2800","5001",4800,{"$f":"Grundbuch!G32","v":0}]
["9.","5000","4800",null,{"$f":"Grundbuch!D68","v":0},"8.","5001","4800",null,{"$f":"Grundbuch!G61","v":0}]
{"$rows_left_out":100}
{"sheet":"GuV","index":3,"n_rows":13,"n_cols":6,"rows_kept":13,"cut":false,"hidden":false,"merged":[[0,0,0,5],[2,1,2,4]]}
["Gewinn- und Verlustrechnung"]
[]
["Soll","8020 Gewinn und Verlust",null,null,null,"Haben"]
["5200",{"$f":"VLOOKUP(A4,Kontenplan!$A$4:$B$35,2)","v":"Bestandsveränderungen"},{"$f":"IF(Hauptbuch!J131>0,Hauptbuch!J131,0)","v":70000},"5000",{"$f":"VLOOKUP(D4,Kontenplan!$A$4:$B$35,2)","v":"Umsatzerlöse"},{"$f":"Hauptbuch!E119","v":0}]
["6000","Aufwendungen für Rohstoffe",{"$f":"Hauptbuch!J135","v":0},"5200",{"$f":"VLOOKUP(D5,Kontenplan!$A$4:$B$35,2)","v":"Bestandsveränderungen"},{"$f":"IF(Hauptbuch!E131>0,Hauptbuch!E131,0)","v":0}]
["6020","Aufwendungen für Hilfsstoffe",{"$f":"Hauptbuch!J138","v":0}]
["6030","Aufwendungen für Betriebsstoffe",{"$f":"Hauptbuch!J141","v":0}]
["6140","Frachten und Fremdlager",{"$f":"Hauptbuch!J144","v":0}]
["6160","Fremdinstandhaltung",{"$f":"Hauptbuch!J147","v":0}]
["6520","Abschreibungen auf Sachanlagen",{"$f":"Hauptbuch!J151","v":0}]
["6870","Werbung",{"$f":"Hauptbuch!J157","v":0}]
[{"$f":"IF(SUM($F$4:$F$11)>SUM($C$4:$C$11),\"3000\",\"\")","v":""},{"$f":"IF(SUM($F$4:$F$11)>SUM($C$4:$C$11),\"Eigenkapital\",\"\")","v":""},{"$f":"IF(SUM($F$4:$F$11)>SUM($C$4:$C$11),SUM($F$4:$F$11)-SUM($C$4:$C$11),0)","v":0},{"$f":"IF(SUM($F$4:$F$11)>SUM($C$4:$C$11),\"\",\"3000\")","v":"3000"},{"$f":"IF(SUM($F$4:$F$11)>SUM($C$4:$C$11),\"\",\"Eigenkapital\")","v":"Eigenkapital"},{"$f":"IF(SUM($C$4:$C$11)>SUM($F$4:$F$7),SUM($C$4:$C$11)-SUM($F$4:$F$7),0)","v":70000}]
[null,null,{"$f":"IF(SUM($F$4:$F$11)>SUM($C$4:$C$11),SUM($F$4:$F$11),SUM($C$4:$C$11))","v":70000},null,null,{"$f":"SUM(F4:F12)","v":70000}]

{"sheet":"Bilanzbuch","index":4,"n_rows":31,"n_cols":6,"rows_kept":31,"cut":false,"hidden":false,"merged":[[2,1,2,4],[0,0,0,5],[17,1,17,4]]}
["Bilanzbuch"]
[]
["Aktiva","8000 Eröffnungsbilanz",null,null,null,"Passiva"]
["0500",{"$f":"VLOOKUP(A4,Kontenplan!$A$4:$B$35,2)","v":"Grundstücke und Bauten"},880000,"3000",{"$f":"VLOOKUP(D4,Kontenplan!$A$4:$B$35,2)","v":"Eigenkapital"},{"$f":"F16-SUM(F5:F15)","v":1213000}]
["0700",{"$f":"VLOOKUP(A5,Kontenplan!$A$4:$B$35,2)","v":"Technische Anlagen und Maschinen"},545000,"4200","Verbindlichkeiten g. Kreditinstitute",760000]
["0800",{"$f":"VLOOKUP(A6,Kontenplan!$A$4:$B$35,2)","v":"Beriebs- und Geschäftsausstattung"},125000,"4400",{"$f":"VLOOKUP(D6,Kontenplan!$A$4:$B$35,2)","v":"Verbindlichkeiten a.L.u.L."},46000]
["0840","Fuhrpark",110000,"4800",{"$f":"VLOOKUP(D7,Kontenplan!$A$4:$B$35,2)","v":"Umsatzsteuer"},10400]
["2000",{"$f":"VLOOKUP(A8,Kontenplan!$A$4:$B$35,2)","v":"Rohstoffe"},98000]
["2020",{"$f":"VLOOKUP(A9,Kontenplan!$A$4:$B$35,2)","v":"Hilfsstoffe"},24000]
["2030",{"$f":"VLOOKUP(A10,Kontenplan!$A$4:$B$35,2)","v":"Betriebsstoffe"},9200]
["2100",{"$f":"VLOOKUP(A11,Kontenplan!$A$4:$B$35,2)","v":"Unfertige Erzeugnisse"},24000]
["2200",{"$f":"VLOOKUP(A12,Kontenplan!$A$4:$B$35,2)","v":"Fertige Erzeugnisse"},46000]
["2400",{"$f":"VLOOKUP(A13,Kontenplan!$A$4:$B$35,2)","v":"Forderungen a.L.u.L."},84000]
["2800",{"$f":"VLOOKUP(A14,Kontenplan!$A$4:$B$35,2)","v":"Kreditinstitute/Bank"},75000]
["2880",{"$f":"VLOOKUP(A15,Kontenplan!$A$4:$B$35,2)","v":"Kasse"},9200]
[null,null,{"$f":"SUM(C4:C15)","v":2029400},null,null,{"$f":"C16","v":2029400}]
[]
["Aktiva","8010 Schlussbilanz",null,null,null,"Passiva"]
["0500",{"$f":"VLOOKUP(A19,Kontenplan!$A$4:$B$35,2)","v":"Grundstücke und Bauten"},{"$f":"Hauptbuch!J4","v":880000},"3000",{"$f":"VLOOKUP(D19,Kontenplan!$A$4:$B$35,2)","v":"Eigenkapital"},{"$f":"Hauptbuch!E93","v":1143000}]
["0700",{"$f":"VLOOKUP(A20,Kontenplan!$A$4:$B$35,2)","v":"Technische Anlagen und Maschinen"},{"$f":"Hauptbuch!J8","v":545000},"4200","Verbindlichkeiten g. Kreditinstitute",{"$f":"Hauptbuch!E97","v":760000}]
["0800",{"$f":"VLOOKUP(A21,Kontenplan!$A$4:$B$35,2)","v":"Beriebs- und Geschäftsausstattung"},{"$f":"Hauptbuch!J13","v":125000},"4400",{"$f":"VLOOKUP(D21,Kontenplan!$A$4:$B$35,2)","v":"Verbindlichkeiten a.L.u.L."},{"$f":"Hauptbuch!E103","v":46000}]
["0840","Fuhrpark",{"$f":"Hauptbuch!J19","v":110000},"4800",{"$f":"VLOOKUP(D22,Kontenplan!$A$4:$B$35,2)","v":"Umsatzsteuer"},{"$f":"Hauptbuch!E113","v":10400}]
["2000",{"$f":"VLOOKUP(A23,Kontenplan!$A$4:$B$35,2)","v":"Rohstoffe"},{"$f":"Hauptbuch!J26","v":98000}]
["2020",{"$f":"VLOOKUP(A24,Kontenplan!$A$4:$B$35,2)","v":"Hilfsstoffe"},{"$f":"Hauptbuch!J39","v":24000}]
["2030",{"$f":"VLOOKUP(A25,Kontenplan!$A$4:$B$35,2)","v":"Betriebsstoffe"},{"$f":"Hauptbuch!J45","v":9200}]
["2100",{"$f":"VLOOKUP(A26,Kontenplan!$A$4:$B$35,2)","v":"Unfertige Erzeugnisse"},{"$f":"Grundbuch!D159","v":0}]
["2200",{"$f":"VLOOKUP(A27,Kontenplan!$A$4:$B$35,2)","v":"Fertige Erzeugnisse"},{"$f":"Grundbuch!D160","v":0}]
["2400",{"$f":"VLOOKUP(A28,Kontenplan!$A$4:$B$35,2)","v":"Forderungen a.L.u.L."},{"$f":"Hauptbuch!J63","v":84000}]
["2800",{"$f":"VLOOKUP(A29,Kontenplan!$A$4:$B$35,2)","v":"Kreditinstitute/Bank"},{"$f":"Hauptbuch!J80","v":75000}]
["2880",{"$f":"VLOOKUP(A30,Kontenplan!$A$4:$B$35,2)","v":"Kasse"},{"$f":"Hauptbuch!J88","v":9200}]
[null,null,{"$f":"SUM(C19:C30)","v":1959400},null,null,{"$f":"SUM(F19:F30)","v":1959400}]

{"sheet":"Kontenplan","index":5,"n_rows":35,"n_cols":2,"rows_kept":35,"cut":false,"hidden":false,"merged":[]}
[null,"Kontenplan"]
[]
["Nr.","Konto"]
["0500","Grundstücke und Bauten"]
["0700","Technische Anlagen und Maschinen"]
["0800","Beriebs- und Geschäftsausstattung"]
["0840","Fuhrpark"]
["2000","Rohstoffe"]
["2001","Bezugskosten (Rohstoffe)"]
["2002","Nachlässe (Rohstoffe)"]
["2020","Hilfsstoffe"]
["2030","Betriebsstoffe"]
["2100","Unfertige Erzeugnisse"]
["2200","Fertige Erzeugnisse"]
["2400","Forderungen a.L.u.L."]
["2600","Vorsteuer"]
["2800","Kreditinstitute/Bank"]
["2880","Kasse"]
["3000","Eigenkapital"]
["4200","Verbindlichkeiten g. Kreditinstitute"]
["4400","Verbindlichkeiten a.L.u.L."]
["4800","Umsatzsteuer"]
["5000","Umsatzerlöse"]
["5001","Erlösberichtigungen"]
["5200","Bestandsveränderungen"]
["6000","Aufwendungen für Rohstoffe"]
["6020","Aufwendungen für Hilfsstoffe"]
["6030","Aufwendungen für Betriebsstoffe"]
["6140","Frachten und Fremdlager"]
["6160","Fremdinstandhaltung"]
["6520","Abschreibungen auf Sachanlagen"]
["6870","Werbung"]
["8000","Eröffnungsbilanz"]
["8010","Schlussbilanz"]
["8020","Gewinn und Verlust"]