{"text_format":"1","workbook":"xlsx","n_sheets":6,"sheets":["Hinweise","Grundbuch","Hauptbuch","GuV","Bilanzbuch","Kontenplan"],"not_rendered":{"charts":0,"images":15,"macros":1,"external_links":0,"defined_names":0,"comments":0,"pivot_tables":0},"unopened":[],"bounds":{"document_bytes":16777216,"sheet_cells":100000,"rows_first":2000,"rows_last":500,"rows_between":2000,"halvings":0,"cell_chars":16384,"cell_head_chars":4096},"cells_cut":0,"cells_raw":0,"read":"whole","date_system":"1900"}

{"sheet":"Hinweise","index":0,"n_rows":25,"n_cols":1,"rows_kept":25,"cut":false,"hidden":false,"merged":[[0,0,0,7],[2,0,2,1],[4,0,6,2]]}
["Geschäftsgang 1"]
[]
["Voraussetzungen"]
["Um den Geschäftsgang buchen zu können, müssen Sie Kenntnisse über die folgenden Lehrninhalte haben:"]
["Buchungen auf Bestandskonten Buchungen auf Erfolgskonten"]
[]
[]
[]
["Vorgehensweise"]
["1. Wählen Sie die Tabelle \"Grundbuch\"."]
[]
["2. Buchen Sie die Geschäftsvorfälle"]
["    entweder durch Direkteingabe in die entsprechenden Felder des Grundbuchs (Kontennummern und Beträge)"]
["    oder durch Aufruf von Buchungsfenstern. (Klicken Sie dazu jeweils auf die Schaltfläche \"Buchung\" und beenden"]
["    Sie die Eingabe  mit \"OK\".)"]
["    Die Kontennummern sind vierstellig anzugeben. (siehe Kontenplan). Bei zusammengesetzten Buchungssätzen"]
["    sind die Buchungen nach der Höhe der Beträge geordnet vorzunehmen. "]
[]
["3. Sie können sich den Kontenplan mit Kontennummern jederzeit durch Klick auf den"]
["    entsprechenden Button anzeigen lassen."]
[]
["4. Die Richtigkeit Ihrer Buchungen wird bestätigt oder Sie werden auf"]
["    Fehler hingewiesen. (Ohne Buchung werden Fehler angezeigt.)"]
[]
["5. Hauptbuch, Gewinn und Verlust und Bilanzbuch werden automatisch erstellt. "]

{"sheet":"Grundbuch","index":1,"n_rows":100,"n_cols":7,"rows_kept":100,"cut":false,"hidden":false,"merged":[[99,0,99,6],[9,0,10,0],[9,1,10,1],[9,2,10,2],[9,3,10,3],[12,5,12,6],[13,5,13,6],[14,5,14,6],[9,4,10,4],[9,5,10,5],[9,6,10,6],[1,0,1,4],[2,0,2,4],[12,1,14,2],[7,5,7,6],[5,1,7,2],[5,5,5,6],[6,5,6,6],[16,4,17,4],[16,5,17,5],[16,6,17,6],[19,5,19,6],[16,0,17,0],[16,1,17,1],[16,2,17,2],[16,3,17,3],[19,1,21,3],[20,5,20,6],[21,5,21,6],[23,0,24,0],[23,1,24,1],[23,2,24,2],[23,3,24,3],[30,3,31,3],[26,1,28,3],[26,5,26,6],[27,5,27,6],[28,5,28,6],[23,4,24,4],[23,5,24,5],[23,6,24,6],[35,5,35,6],[36,5,36,6],[38,0,40,0],[30,4,31,4],[30,5,31,5],[30,6,31,6],[33,5,34,6],[30,0,31,0],[30,1,31,1],[30,2,31,2],[46,0,47,0],[46,1,47,1],[46,2,47,2],[46,3,47,3],[42,1,44,3],[42,5,42,6],[43,5,43,6],[44,5,44,6],[46,4,47,4],[46,5,47,5],[46,6,47,6],[53,4,54,4],[53,5,54,5],[53,6,54,6],[49,1,51,3],[49,5,49,6],[50,5,50,6],[51,5,51,6],[53,0,54,0],[53,1,54,1],[53,2,54,2],[53,3,54,3],[60,0,61,0],[60,1,61,1],[60,2,61,2],[60,3,61,3],[56,1,58,3],[56,5,56,6],[57,5,57,6],[58,5,58,6],[60,4,61,4],[60,5,61,5],[60,6,61,6],[63,1,65,3],[63,5,63,6],[64,5,64,6],[65,5,65,6],[79,5,79,6],[67,4,68,4],[67,5,68,5],[67,6,68,6],[70,5,70,6],[67,0,68,0],[67,1,68,1],[67,2,68,2],[67,3,68,3],[81,0,82,0],[81,1,82,1],[81,2,82,2],[81,3,82,3],[71,5,71,6],[72,5,72,6],[74,0,75,0],[77,1,79,3],[77,5,77,6],[78,5,78,6],[88,1,89,1],[88,2,89,2],[88,3,89,3],[81,4,82,4],[81,5,82,5],[81,6,82,6],[84,1,86,3],[84,5,84,6],[85,5,85,6],[86,5,86,6],[92,5,92,6],[93,5,93,6],[95,0,96,0],[92,2,92,3],[93,2,93,3],[88,4,89,4],[88,5,89,5],[88,6,89,6],[91,5,91,6],[88,0,89,0]]}
[]
["Geschäftsvorfälle"]
["Grundbuch"]
[]
[]
["1.","Zieleinkauf von Baumwollstoffen,",null,null,11200,{"$f":"IF(AND(B10=\"2000\",E10=\"4400\"),\"Die Konten sind richtig!\",\"Mindestens ein Konto ist falsch!\")","v":"Mindestens ein Konto ist falsch!"}]
["Geschäftsvorfall",null,null,null,null,{"$f":"IF(AND(D10=E6,G10=E6),\"Die Beträge sind richtig!\",\"Mindestens ein Betrag ist falsch!\")","v":"Mindestens ein Betrag ist falsch!"}]
[null,null,null,null,null,{"$f":"IF(AND(F6=\"Die Konten sind richtig!\",F7=\"Die Beträge sind richtig!\"),\"Alles richtig!\",\"Es sind noch Fehler vorhanden!\")","v":"Es sind noch Fehler vorhanden!"}]
[null,"Soll","Konto","€","Haben","Konto","€"]
["Buchungssatz","",{"$f":"IF(B10=\"\",\"\",VLOOKUP(B10,Kontenplan!$A$4:$B$30,2))","v":""},null,"",{"$f":"IF(E10=\"\",\"\",VLOOKUP(E10,Kontenplan!$A$4:$B$30,2))","v":""}]
[]
[]
["2.","Lohnzahlung bar,",null,null,2500,{"$f":"IF(AND(B17=\"6200\",E17=\"2880\"),\"Die Konten sind richtig!\",\"Mindestens ein Konto ist falsch!\")","v":"Mindestens ein Konto ist falsch!"}]
["Geschäftsvorfall",null,null,null,null,{"$f":"IF(AND(D17=E13,G17=E13),\"Die Beträge sind richtig!\",\"Mindestens ein Betrag ist falsch!\")","v":"Mindestens ein Betrag ist falsch!"}]
[null,null,null,null,null,{"$f":"IF(AND(F13=\"Die Konten sind richtig!\",F14=\"Die Beträge sind richtig!\"),\"Alles richtig!\",\"Es sind noch Fehler vorhanden!\")","v":"Es sind noch Fehler vorhanden!"}]
[null,"Soll","Konto","€","Haben","Konto","€"]
["Buchungssatz","",{"$f":"IF(B17=\"\",\"\",VLOOKUP(B17,Kontenplan!$A$4:$B$30,2))","v":""},null,"",{"$f":"IF(E17=\"\",\"\",VLOOKUP(E17,Kontenplan!$A$4:$B$30,2))","v":""}]
[]
[]
["3.","Die Kick Moden GmbH begleicht unsere Ausgangsrechnung durch Banküberweisung,",null,null,4200,{"$f":"IF(AND(B24=\"2800\",E24=\"2400\"),\"Die Konten sind richtig!\",\"Mindestens ein Konto ist falsch!\")","v":"Mindestens ein Konto ist falsch!"}]
["Geschäftsvorfall",null,null,null,null,{"$f":"IF(AND(D24=E20,G24=E20),\"Die Beträge sind richtig!\",\"Mindestens ein Betrag ist falsch!\")","v":"Mindestens ein Betrag ist falsch!"}]
[null,null,null,null,null,{"$f":"IF(AND(F20=\"Die Konten sind richtig!\",F21=\"Die Beträge sind richtig!\"),\"Alles richtig!\",\"Es sind noch Fehler vorhanden!\")","v":"Es sind noch Fehler vorhanden!"}]
[null,"Soll","Konto","€","Haben","Konto","€"]
["Buchungssatz","",{"$f":"IF(B24=\"\",\"\",VLOOKUP(B24,Kontenplan!$A$4:$B$30,2))","v":""},null,"",{"$f":"IF(E24=\"\",\"\",VLOOKUP(E24,Kontenplan!$A$4:$B$30,2))","v":""}]
[]
[]
["4.","Barzahlung für eine Maschinenreparatur,",null,null,820,{"$f":"IF(AND(B31=\"6160\",E31=\"2880\"),\"Die Konten sind richtig!\",\"Mindestens ein Konto ist falsch!\")","v":"Mindestens ein Konto ist falsch!"}]
["Geschäftsvorfall",null,null,null,null,{"$f":"IF(AND(D31=E27,G31=E27),\"Die Beträge sind richtig!\",\"Mindestens ein Betrag ist falsch!\")","v":"Mindestens ein Betrag ist falsch!"}]
[null,null,null,null,null,{"$f":"IF(AND(F27=\"Die Konten sind richtig!\",F28=\"Die Beträge sind richtig!\"),\"Alles richtig!\",\"Es sind noch Fehler vorhanden!\")","v":"Es sind noch Fehler vorhanden!"}]
[null,"Soll","Konto","€","Haben","Konto","€"]
["Buchungssatz","",{"$f":"IF(B31=\"\",\"\",VLOOKUP(B31,Kontenplan!$A$4:$B$30,2))","v":""},null,"",{"$f":"IF(E31=\"\",\"\",VLOOKUP(E31,Kontenplan!$A$4:$B$30,2))","v":""}]
[]
[]
["5.","Verbrauch lt. Materialentnahmescheine für",null,null,null,{"$f":"IF(AND(B39=\"6000\",E39=\"2000\",B40=\"6020\",E40=\"2020\",B41=\"6030\",E41=\"2030\"),\"Die Konten sind richtig!\",\"Mindestens ein Konto ist falsch!\")","v":"Mindestens ein Konto ist falsch!"}]
["Geschäftsvorfall",null,"           - Rohstoffe",null,4500]
[null,null,"           - Hilfsstoffe",null,230,{"$f":"IF(AND(D39=E35,D40=E36,D41=E37,G39=E35,G40=E36,G41=E37),\"Die Beträge sind richtig!\",\"Mindestens ein Betrag ist falsch!\")","v":"Mindestens ein Betrag ist falsch!"}]
[null,null,"           - Betriebsstoffe",null,450,{"$f":"IF(AND(F34=\"Die Konten sind richtig!\",F36=\"Die Beträge sind richtig!\"),\"Alles richtig!\",\"Es sind noch Fehler vorhanden!\")","v":"Es sind noch Fehler vorhanden!"}]
[null,"Soll","Konto","€","Haben","Konto","€"]
["Buchungssatz","",{"$f":"IF(B39=\"\",\"\",VLOOKUP(B39,Kontenplan!$A$4:$B$30,2))","v":""},null,"",{"$f":"IF(E39=\"\",\"\",VLOOKUP(E39,Kontenplan!$A$4:$B$30,2))","v":""}]
[null,"",{"$f":"IF(B40=\"\",\"\",VLOOKUP(B40,Kontenplan!$A$4:$B$30,2))","v":""},null,"",{"$f":"IF(E40=\"\",\"\",VLOOKUP(E40,Kontenplan!$A$4:$B$30,2))","v":""}]
[null,"",{"$f":"IF(B41=\"\",\"\",VLOOKUP(B41,Kontenplan!$A$4:$B$30,2))","v":""},null,"",{"$f":"IF(E41=\"\",\"\",VLOOKUP(E41,Kontenplan!$A$4:$B$30,2))","v":""}]
[]
["6.","Die Zip GmbH belastet uns mit Verzugszinsen,",null,null,60,{"$f":"IF(AND(B47=\"7510\",E47=\"4400\"),\"Die Konten sind richtig!\",\"Mindestens ein Konto ist falsch!\")","v":"Mindestens ein Konto ist falsch!"}]
["Geschäftsvorfall",null,null,null,null,{"$f":"IF(AND(D47=E43,G47=E43),\"Die Beträge sind richtig!\",\"Mindestens ein Betrag ist falsch!\")","v":"Mindestens ein Betrag ist falsch!"}]
[null,null,null,null,null,{"$f":"IF(AND(F43=\"Die Konten sind richtig!\",F44=\"Die Beträge sind richtig!\"),\"Alles richtig!\",\"Es sind noch Fehler vorhanden!\")","v":"Es sind noch Fehler vorhanden!"}]
[null,"Soll","Konto","€","Haben","Konto","€"]
["Buchungssatz","",{"$f":"IF(B47=\"\",\"\",VLOOKUP(B47,Kontenplan!$A$4:$B$31,2))","v":""},null,"",{"$f":"IF(E47=\"\",\"\",VLOOKUP(E47,Kontenplan!$A$4:$B$30,2))","v":""}]
[]
[]
["7.","Ausgangsrechnung an die Route 66 GmbH für Verkäufe von Jeans, Jeansjacken und T-Shirts",null,null,18500,{"$f":"IF(AND(B54=\"2400\",E54=\"5000\"),\"Die Konten sind richtig!\",\"Mindestens ein Konto ist falsch!\")","v":"Mindestens ein Konto ist falsch!"}]
["Geschäftsvorfall",null,null,null,null,{"$f":"IF(AND(D54=E50,G54=E50),\"Die Beträge sind richtig!\",\"Mindestens ein Betrag ist falsch!\")","v":"Mindestens ein Betrag ist falsch!"}]
[null,null,null,null,null,{"$f":"IF(AND(F50=\"Die Konten sind richtig!\",F51=\"Die Beträge sind richtig!\"),\"Alles richtig!\",\"Es sind noch Fehler vorhanden!\")","v":"Es sind noch Fehler vorhanden!"}]
[null,"Soll","Konto","€","Haben","Konto","€"]
["Buchungssatz","",{"$f":"IF(B54=\"\",\"\",VLOOKUP(B54,Kontenplan!$A$4:$B$31,2))","v":""},null,"",{"$f":"IF(E54=\"\",\"\",VLOOKUP(E54,Kontenplan!$A$4:$B$30,2))","v":""}]
[]
[]
["8.","Zieleinkauf eines Druckers,",null,null,450,{"$f":"IF(AND(B61=\"0800\",E61=\"4400\"),\"Die Konten sind richtig!\",\"Mindestens ein Konto ist falsch!\")","v":"Mindestens ein Konto ist falsch!"}]
["Geschäftsvorfall",null,null,null,null,{"$f":"IF(AND(D61=E57,G61=E57),\"Die Beträge sind richtig!\",\"Mindestens ein Betrag ist falsch!\")","v":"Mindestens ein Betrag ist falsch!"}]
[null,null,null,null,null,{"$f":"IF(AND(F57=\"Die Konten sind richtig!\",F58=\"Die Beträge sind richtig!\"),\"Alles richtig!\",\"Es sind noch Fehler vorhanden!\")","v":"Es sind noch Fehler vorhanden!"}]
[null,"Soll","Konto","€","Haben","Konto","€"]
["Buchungssatz","",{"$f":"IF(B61=\"\",\"\",VLOOKUP(B61,Kontenplan!$A$4:$B$31,2))","v":""},null,"",{"$f":"IF(E61=\"\",\"\",VLOOKUP(E61,Kontenplan!$A$4:$B$30,2))","v":""}]
[]
[]
["9.","Barverkauf von Jeans,",null,null,3600,{"$f":"IF(AND(B68=\"2880\",E68=\"5000\"),\"Die Konten sind richtig!\",\"Mindestens ein Konto ist falsch!\")","v":"Mindestens ein Konto ist falsch!"}]
["Geschäftsvorfall",null,null,null,null,{"$f":"IF(AND(D68=E64,G68=E64),\"Die Beträge sind richtig!\",\"Mindestens ein Betrag ist falsch!\")","v":"Mindestens ein Betrag ist falsch!"}]
[null,null,null,null,null,{"$f":"IF(AND(F64=\"Die Konten sind richtig!\",F65=\"Die Beträge sind richtig!\"),\"Alles richtig!\",\"Es sind noch Fehler vorhanden!\")","v":"Es sind noch Fehler vorhanden!"}]
[null,"Soll","Konto","€","Haben","Konto","€"]
["Buchungssatz","",{"$f":"IF(B68=\"\",\"\",VLOOKUP(B68,Kontenplan!$A$4:$B$31,2))","v":""},null,"",{"$f":"IF(E68=\"\",\"\",VLOOKUP(E68,Kontenplan!$A$4:$B$30,2))","v":""}]
[]
[]
["10.","Banklastschrift für - Kreditzinsen",null,null,450,{"$f":"IF(AND(B75=\"7510\",B76=\"6700\",E75=\"2800\"),\"Die Konten sind richtig!\",\"Mindestens ein Konto ist falsch!\")","v":"Mindestens ein Konto ist falsch!"}]
["Geschäftsvorfall",null,"       - Lagerraummiete",null,2400,{"$f":"IF(AND(D75=E71,D76=E72,G75=E73),\"Die Beträge sind richtig!\",\"Mindestens ein Betrag ist falsch!\")","v":"Mindestens ein Betrag ist falsch!"}]
[null,null,"         Banklastschrift",null,{"$f":"SUM(E71:E72)","v":2850},{"$f":"IF(AND(F71=\"Die Konten sind richtig!\",F72=\"Die Beträge sind richtig!\"),\"Alles richtig!\",\"Es sind noch Fehler vorhanden!\")","v":"Es sind noch Fehler vorhanden!"}]
[null,"Soll","Konto","€","Haben","Konto","€"]
["Buchungssatz","",{"$f":"IF(B75=\"\",\"\",VLOOKUP(B75,Kontenplan!$A$4:$B$30,2))","v":""},null,"",{"$f":"IF(E75=\"\",\"\",VLOOKUP(E75,Kontenplan!$A$4:$B$30,2))","v":""}]
[null,"",{"$f":"IF(B76=\"\",\"\",VLOOKUP(B76,Kontenplan!$A$4:$B$30,2))","v":""}]
[]
["11.","Barzahlung für Werbeprospekte",null,null,400,{"$f":"IF(AND(B82=\"6870\",E82=\"2880\"),\"Die Konten sind richtig!\",\"Mindestens ein Konto ist falsch!\")","v":"Mindestens ein Konto ist falsch!"}]
["Geschäftsvorfall",null,null,null,null,{"$f":"IF(AND(D82=E78,G82=E78),\"Die Beträge sind richtig!\",\"Mindestens ein Betrag ist falsch!\")","v":"Mindestens ein Betrag ist falsch!"}]
[null,null,null,null,null,{"$f":"IF(AND(F78=\"Die Konten sind richtig!\",F79=\"Die Beträge sind richtig!\"),\"Alles richtig!\",\"Es sind noch Fehler vorhanden!\")","v":"Es sind noch Fehler vorhanden!"}]
{"$rows_left_out":21}
{"sheet":"Hauptbuch","index":2,"n_rows":100,"n_cols":10,"rows_kept":100,"cut":false,"hidden":false,"merged":[[25,1,25,8],[30,1,30,8],[0,0,0,9],[2,1,2,8],[5,1,5,8],[10,1,10,8],[15,1,15,8],[20,1,20,8],[54,1,54,8],[62,1,62,8],[33,1,33,8],[36,1,36,8],[41,1,41,8],[47,1,47,8],[96,1,96,8],[59,1,59,8],[75,1,75,8],[84,1,84,8],[78,1,78,8],[81,1,81,8],[69,1,69,8],[87,1,87,8],[93,1,93,8],[90,1,90,8]]}
["Hauptbuch"]
[]
["Soll","0510 Bebaute Grundstücke",null,null,null,null,null,null,null,"Haben"]
["AB","8000",null,null,{"$f":"Bilanzbuch!C4","v":500000},"SB",8010,null,null,{"$f":"E4","v":500000}]
[]
["Soll","0700 Technische Anlagen und Maschinen",null,null,null,null,null,null,null,"Haben"]
["AB","8000",null,null,{"$f":"Bilanzbuch!C5","v":245000},"12.","2880",null,null,{"$f":"Grundbuch!G89","v":0}]
[null,null,null,null,null,"SB",8010,null,null,{"$f":"J9-SUM(J7:J7)","v":245000}]
[null,null,null,null,{"$f":"SUM(E7:E8)","v":245000},null,null,null,null,{"$f":"E9","v":245000}]
[]
["Soll","0800 Betriebs- und Geschäftsausstattung",null,null,null,null,null,null,null,"Haben"]
["AB","8000",null,null,{"$f":"Bilanzbuch!C6","v":124500},"SB",8010,null,null,{"$f":"J14","v":124500}]
["8.",4400,null,null,{"$f":"Grundbuch!D61","v":0}]
[null,null,null,null,{"$f":"SUM(E12:E13)","v":124500},null,null,null,null,{"$f":"E14","v":124500}]
[]
["Soll","2000 Rohstoffe",null,null,null,null,null,null,null,"Haben"]
["AB","8000",null,null,{"$f":"Bilanzbuch!C7","v":138000},"5.","6000",null,null,{"$f":"Grundbuch!G39","v":0}]
["1.","4400",null,null,{"$f":"Grundbuch!D10","v":0},"SB",8010,null,null,{"$f":"J19-J17","v":138000}]
[null,null,null,null,{"$f":"SUM(E17:E18)","v":138000},null,null,null,null,{"$f":"E19","v":138000}]
[]
["Soll","2020 Hilfsstoffe",null,null,null,null,null,null,null,"Haben"]
["AB","8000",null,null,{"$f":"Bilanzbuch!C8","v":6700},"5.","6020",null,null,{"$f":"Grundbuch!G40","v":0}]
[null,null,null,null,null,"SB",8010,null,null,{"$f":"J24-J22","v":6700}]
[null,null,null,null,{"$f":"SUM(E22:E23)","v":6700},null,null,null,null,{"$f":"E24","v":6700}]
[]
["Soll","2030 Betriebsstoffe",null,null,null,null,null,null,null,"Haben"]
["AB","8000",null,null,{"$f":"Bilanzbuch!C9","v":2100},"5.","6030",null,null,{"$f":"Grundbuch!G41","v":0}]
[null,null,null,null,null,"SB",8010,null,null,{"$f":"J29-J27","v":2100}]
[null,null,null,null,{"$f":"SUM(E27:E28)","v":2100},null,null,null,null,{"$f":"E29","v":2100}]
[]
["Soll","2100 Unfertige Erzeugnisse",null,null,null,null,null,null,null,"Haben"]
["AB","8000",null,null,{"$f":"Bilanzbuch!C10","v":120000},"SB",null,null,null,{"$f":"E32","v":120000}]
[]
["Soll","2200 Fertige Erzeugnisse",null,null,null,null,null,null,null,"Haben"]
["AB","8000",null,null,{"$f":"Bilanzbuch!C11","v":25800},"SB",null,null,null,{"$f":"E35","v":25800}]
[]
["Soll","2400 Forderungen aus Lieferungen und Leistungen",null,null,null,null,null,null,null,"Haben"]
["AB","8000",null,null,{"$f":"Bilanzbuch!C12","v":53800},"3.",2800,null,null,{"$f":"Grundbuch!G24","v":0}]
["7.",4400,null,null,{"$f":"Grundbuch!D54","v":0},"SB",8010,null,null,{"$f":"J40-J38","v":53800}]
[null,null,null,null,{"$f":"SUM(E38:E39)","v":53800},null,null,null,null,{"$f":"E40","v":53800}]
[]
["Soll","2800 Kreditinstitute/Bank",null,null,null,null,null,null,null,"Haben"]
["AB","8000",null,null,{"$f":"Bilanzbuch!C13","v":99800},"9.","7510","6700",null,{"$f":"Grundbuch!G75","v":0}]
["3.","2400",null,null,{"$f":"Grundbuch!D24","v":0},"SB",8010,null,null,{"$f":"J46-J43","v":99800}]
["13.","5000",null,null,{"$f":"Grundbuch!D97","v":0}]
[null,null,null,null,{"$f":"SUM(E43:E45)","v":99800},null,null,null,null,{"$f":"E46","v":99800}]
[]
["Soll","2880 Kasse",null,null,null,null,null,null,null,"Haben"]
["AB","8000",null,null,{"$f":"Bilanzbuch!C14","v":5600},"2.","6200",null,null,{"$f":"Grundbuch!G17","v":0}]
["9.","5000",null,null,{"$f":"Grundbuch!D68","v":0},"4.","6160",null,null,{"$f":"Grundbuch!G31","v":0}]
["12.","0700",null,null,{"$f":"Grundbuch!D89","v":0},"11.","6870",null,null,{"$f":"Grundbuch!G82","v":0}]
["13.",5000,null,null,{"$f":"Grundbuch!D96","v":0},"SB",8010,null,null,{"$f":"J53-SUM(J49:J51)","v":5600}]
[null,null,null,null,{"$f":"SUM(E49:E52)","v":5600},null,null,null,null,{"$f":"E53","v":5600}]
[]
["Soll","3000 Eigenkapital",null,null,null,null,null,null,null,"Haben"]
["A",8020,null,null,{"$f":"IF(GuV!F12>0,GuV!F12,0)","v":0},"AB",8000,null,null,{"$f":"Bilanzbuch!F4","v":792400}]
["SB",8010,null,null,{"$f":"E58-E56","v":792400},"A",8020,null,null,{"$f":"IF(GuV!C12>0,GuV!C12,0)","v":0}]
[null,null,null,null,{"$f":"J58","v":792400},null,null,null,null,{"$f":"SUM(J56:J57)","v":792400}]
[]
["Soll","4200 Verbindlichkeiten gegenüber Kreditinsituten",null,null,null,null,null,null,null,"Haben"]
["SB","8000",null,null,{"$f":"Bilanzbuch!F5","v":450000},"AB",8000,null,null,{"$f":"Bilanzbuch!F5","v":450000}]
[]
["Soll","4400 Verbindlichkeiten aus Lieferungen und Leistungen",null,null,null,null,null,null,null,"Haben"]
["SB",8010,null,null,{"$f":"E68-SUM(E65:E67)","v":78900},"AB",8000,null,null,{"$f":"Bilanzbuch!F6","v":78900}]
[null,null,null,null,null,"1.","2000",null,null,{"$f":"Grundbuch!G10","v":0}]
[null,null,null,null,null,"6.","7510",null,null,{"$f":"Grundbuch!G47","v":0}]
[null,null,null,null,null,"8.","0800",null,null,{"$f":"Grundbuch!G61","v":0}]
[null,null,null,null,{"$f":"J68","v":78900},null,null,null,null,{"$f":"SUM(J64:J67)","v":78900}]
[]
["Soll","5000 Umsatzerlöse",null,null,null,null,null,null,null,"Haben"]
["A",8020,null,null,{"$f":"E74","v":0},"7.","2400",null,null,{"$f":"Grundbuch!G54","v":0}]
[null,null,null,null,null,"9.","2880",null,null,{"$f":"Grundbuch!G68","v":0}]
[null,null,null,null,null,"13.","2880",2800,null,{"$f":"Grundbuch!G96","v":0}]
[null,null,null,null,{"$f":"J74","v":0},null,null,null,null,{"$f":"SUM(J71:J73)","v":0}]
[]
["Soll","6000 Aufwendungen für Rohstoffe",null,null,null,null,null,null,null,"Haben"]
["5.","2000",null,null,{"$f":"Grundbuch!D39","v":0},"A",8020,null,null,{"$f":"E77","v":0}]
[]
["Soll","6020 Aufwendungen für Hilfsstoffe",null,null,null,null,null,null,null,"Haben"]
["5.","2020",null,null,{"$f":"Grundbuch!D40","v":0},"A",8020,null,null,{"$f":"E80","v":0}]
{"$rows_left_out":21}
{"sheet":"GuV","index":3,"n_rows":13,"n_cols":6,"rows_kept":13,"cut":false,"hidden":false,"merged":[[0,0,0,5],[2,1,2,4]]}
["Gewinn- und Verlustrechnung"]
[]
["Soll","8020 Gewinn und Verlust",null,null,null,"Haben"]
["6000","Aufwendungen für Rohstoffe",{"$f":"Hauptbuch!J77","v":0},"5000","Umsatzerlöse",{"$f":"Hauptbuch!E71","v":0}]
["6020","Aufwendungen für Hilfsstoffe",{"$f":"Hauptbuch!E80","v":0}]
["6030","Aufwendungen für Betriebsstoffe",{"$f":"Hauptbuch!J83","v":0}]
["6160","Fremdinstandhaltung",{"$f":"Hauptbuch!J86","v":0}]
["6200","Löhne",{"$f":"Hauptbuch!J89","v":0}]
["6700","Mieten",{"$f":"Hauptbuch!J92","v":0}]
["6870","Werbung",{"$f":"Hauptbuch!J95","v":0}]
["7510","Zinsaufwendungen",{"$f":"Hauptbuch!J98","v":0}]
[{"$f":"IF(SUM($F$4:$F$7)>SUM($C$4:$C$11),\"3000\",\"\")","v":""},{"$f":"IF(SUM($F$4:$F$7)>SUM($C$4:$C$11),\"Eigenkapital\",\"\")","v":""},{"$f":"IF(SUM($F$4:$F$7)>SUM($C$4:$C$11),SUM($F$4:$F$7)-SUM($C$4:$C$11),0)","v":0},{"$f":"IF(SUM($F$4:$F$7)<SUM($C$4:$C$11),\"3000\",\"\")","v":""},{"$f":"IF(SUM($F$4:$F$7)<SUM($C$4:$C$11),\"Eigenkapital\",\"\")","v":""},{"$f":"IF(SUM($F$4:$F$7)<SUM($C$4:$C$11),SUM($C$4:$C$11)-SUM($F$4:$F$7),0)","v":0}]
[null,null,{"$f":"IF(SUM($F$4:$F$7)>SUM($C$4:$C$11),SUM($F$4:$F$7),SUM($C$4:$C$11))","v":0},null,null,{"$f":"IF(SUM($F$4:$F$7)>SUM($C$4:$C$11),SUM($F$4:$F$7),SUM($C$4:$C$11))","v":0}]

{"sheet":"Bilanzbuch","index":4,"n_rows":29,"n_cols":6,"rows_kept":29,"cut":false,"hidden":false,"merged":[[2,1,2,4],[0,0,0,5],[16,1,16,4]]}
["Bilanzbuch"]
[]
["Aktiva","8000 Eröffnungsbilanz",null,null,null,"Passiva"]
["0510","Bebaute Grundstücke",500000,"3000","Eigenkapital",{"$f":"F15-SUM(F5:F14)","v":792400}]
["0700","Technische Anlagen und Maschinen",245000,"4200","Verbindlichkeiten g. Kreditinstituten",450000]
["0800","Betriebs- und Geschäftsausstattung",124500,"4400","Verbindlichkeiten a.L.u.L.",78900]
["2000","Rohstoffe",138000]
["2020","Hilfsstoffe",6700]
["2040","Betriebsstoffe",2100]
["2100","Unfertige Erzeugnisse",120000]
["2200","Fertige Erzeugnisse",25800]
["2400","Forderungen a.L.u.L.",53800]
["2800","Bank",99800]
["2880","Kasse",5600]
[null,null,{"$f":"SUM(C4:C14)","v":1321300},null,null,{"$f":"C15","v":1321300}]
[]
["Aktiva","8010 Schlussbilanz",null,null,null,"Passiva"]
["0510","Bebaute Grundstücke",{"$f":"Hauptbuch!J4","v":500000},"3000","Eigenkapital",{"$f":"Hauptbuch!E57","v":792400}]
["0700","Technische Anlagen und Maschinen",{"$f":"Hauptbuch!J8","v":245000},"4200","Verbindlichkeiten g. Kreditinstituten",{"$f":"Hauptbuch!E61","v":450000}]
["0800","Betriebs- und Geschäftsausstattung",{"$f":"Hauptbuch!J12","v":124500},"4400","Verbindlichkeiten a.L.u.L.",{"$f":"Hauptbuch!E64","v":78900}]
["2000","Rohstoffe",{"$f":"Hauptbuch!J18","v":138000}]
["2020","Hilfsstoffe",{"$f":"Hauptbuch!J23","v":6700}]
["2040","Betriebsstoffe",{"$f":"Hauptbuch!J28","v":2100}]
["2100","Unfertige Erzeugnisse",{"$f":"Hauptbuch!J32","v":120000}]
["2200","Fertige Erzeugnisse",{"$f":"Hauptbuch!J35","v":25800}]
["2400","Forderungen a.L.u.L.",{"$f":"Hauptbuch!J39","v":53800}]
["2800","Bank",{"$f":"Hauptbuch!J44","v":99800}]
["2880","Kasse",{"$f":"Hauptbuch!J52","v":5600}]
[null,null,{"$f":"SUM(C18:C28)","v":1321300},null,null,{"$f":"SUM(F18:F28)","v":1321300}]

{"sheet":"Kontenplan","index":5,"n_rows":30,"n_cols":2,"rows_kept":30,"cut":false,"hidden":false,"merged":[]}
[null,"Kontenplan"]
[]
["Nr.","Konto"]
["0510","Bebaute Grundstücke"]
["0700","Technische Anlagen und Maschinen"]
["0800","Betriebs- und Geschäftsausstattung"]
["2000","Rohstoffe"]
["2020","Hilfsstoffe"]
["2030","Betriebsstoffe"]
["2040","Betriebsstoffe"]
["2100","Unfertige Erzeugnisse"]
["2200","Fertige Erzeugnisse"]
["2400","Forderungen a.L.u.L."]
["2800","Kreditinstitute/Bank"]
["2880","Kasse"]
["3000","Eigenkapital"]
["4200","Verbindlichkeiten g. Kreditinstituten"]
["4400","Verbindlichkeiten a.L.u.L."]
["5000","Umsatzerlöse"]
["6000","Aufwendungen für Rohstoffe"]
["6020","Aufwendungen für Hilfsstoffe"]
["6030","Aufwendungen für Betriebsstoffe"]
["6160","Fremdinstandhaltung"]
["6200","Löhne"]
["6700","Mieten"]
["6870","Werbung"]
["7510","Zinsaufwendungen"]
["8000","Eröffnungsbilanz"]
["8010","Schlussbilanz"]
["8020","Gewinn und Verlust"]